{"text_format":"1","workbook":"xlsx","n_sheets":6,"sheets":["Start Here","Bottom Line","ConnectOneLiner","InvOneLiner","PriceQC","Projections"],"not_rendered":{"charts":0,"images":3,"macros":1,"external_links":0,"defined_names":4,"comments":0,"pivot_tables":0},"unopened":[],"bounds":{"document_bytes":16777216,"sheet_cells":100000,"rows_first":2000,"rows_last":500,"rows_between":2000,"halvings":0,"cell_chars":16384,"cell_head_chars":4096},"cells_cut":0,"cells_raw":0,"read":"whole","date_system":"1900"}

{"sheet":"Start Here","index":0,"n_rows":20,"n_cols":2,"rows_kept":20,"cut":false,"hidden":false,"merged":[[12,1,12,17],[11,1,11,17],[0,7,5,8],[0,0,0,5],[9,1,9,13],[10,1,10,17],[8,1,8,4]]}
["Welcome to V2Connect!"]
[]
[]
[]
[]
[]
[]
[]
[null,"To use this workbook  "]
[null,"1. Open a Project in 2.11 and run an \"V2Connect\" report (under Miscellaneous category) for All Cases for your selected Partner "]
[null,"2. Once it is finished running and you see the output that says \"V2Connect is Ready Please Refresh the Spreadsheet\" minimize or close 2.11 and don't run any more reports. "]
[null,"3. Now hit the green refresh button on this sheet and it will load data from the that economic run in PHDwin 2.11 (macros must be enabled for this sheet)."]
[null,"4. Refer to the sheet named \"Bottom Line\" to get an analysis of this project for totals and QC work or check the tabs to see raw data. Please note warnings below"]
[]
[null,"WARNINGS!"]
[null,"1. This sheet is only intended for the output of data after PHDwin report runs are laid down in Microsoft Access by the program. You are not editing the live dataset and any changes here will not be reflected in the program. "]
[null,"2. This sheet is not intended for multi-partner reporting. If you wish to get a similar One Liner output run the \"Excel One Liner\" report in PHDwin in Multi-scenario mode. "]
[null,"3. This workbook is not intended for the comparing of PHDwin V3 files to V2 and will not be supported for that purpose. For example the output here is the wrong type of decline (nominal) compared to what V2 wants (tangent effective) because V3 stores data differently"]
[null,"4. Microsoft Access is required for full functionality. Sometimes it can take a while for all the queires to refresh. If you cannot enable macros the \"Refresh All\" button on the data ribbon in Excel performs same function of macro and green refresh button"]
[null,"5. This workbook expects the PHDWinOut.mdb to be in the default location of C:\\Program Files (x86)\\PHDWin 2.11\\Reports and if the your report file is elsewhere you must define that new location by right clicking on any of the Queries, clicking \"Edit,\" change the \"Data Source Setting,\" then \"Close and Load\" and save the sheet."]

{"sheet":"Bottom Line","index":1,"n_rows":39,"n_cols":9,"rows_kept":39,"cut":false,"hidden":false,"merged":[[0,0,0,9],[2,6,2,8],[10,1,10,3],[2,1,2,3],[25,1,25,3]]}
[{"$f":"'ConnectOneLiner'!D96","v":"TxWells"}]
[]
[null,"Volumes",null,null,null,null,"Maximum Asset Information"]
[null,"Total Gross Oil",{"$f":"SUM('ConnectOneLiner'!X:X)","v":42.874519983641328},{"$f":"'ConnectOneLiner'!AE96","v":"Mbbl"},null,null,{"$f":"\"Max Net Revenue \"&D12","v":"Max Net Revenue M$"},{"$f":"MAX('ConnectOneLiner'!AN:AN)","v":19038.643384428178},{"$f":"INDEX('ConnectOneLiner'!A:A,MATCH(MAX('ConnectOneLiner'!AN:AN),'ConnectOneLiner'!AN:AN,0))","v":"OSCAR LU 1-18-19WH"}]
[null,"Total Gross Gas",{"$f":"SUM('ConnectOneLiner'!Y:Y)","v":102973.35407999081},{"$f":"'ConnectOneLiner'!AF96","v":"MMcf"},null,null,{"$f":"\"Max Net Expenses \"&D12","v":"Max Net Expenses M$"},{"$f":"MAX('ConnectOneLiner'!AU:AU)","v":8369.8606501512731},{"$f":"INDEX('ConnectOneLiner'!A:A,MATCH(MAX('ConnectOneLiner'!AU:AU),'ConnectOneLiner'!AU:AU,0))","v":"OSCAR LU 1-18-19WH"}]
[null,"Total Gross NGL",{"$f":"SUM('ConnectOneLiner'!Z:Z)","v":0},{"$f":"'ConnectOneLiner'!AG96","v":"bbl"},null,null,"Max Gradient",{"$f":"MAX('ConnectOneLiner'!Q:Q)","v":0},{"$f":"INDEX('ConnectOneLiner'!A:A,MATCH(MAX('ConnectOneLiner'!Q:Q),'ConnectOneLiner'!Q:Q,0))","v":"KLIMEK 10-2H"}]
[null,"Total Net Oil",{"$f":"SUM('ConnectOneLiner'!AB:AB)","v":32.155889987730987},{"$f":"'ConnectOneLiner'!AE96","v":"Mbbl"},null,null,"Max B Factor",{"$f":"MAX(Projections!M:M)","v":1},{"$f":"INDEX(Projections!C:C,MATCH(MAX(Projections!M:M),Projections!M:M,0))","v":"FIELDS 19-1HX"}]
[null,"Total Net Gas",{"$f":"SUM('ConnectOneLiner'!AC:AC)","v":77230.015559993102},{"$f":"'ConnectOneLiner'!AF96","v":"MMcf"},null,null,"Last ECL After Date",{"$f":"MAX('ConnectOneLiner'!BH:BH)","v":"00:00:00"},{"$f":"INDEX('ConnectOneLiner'!A:A,MATCH(MAX('ConnectOneLiner'!BH:BH),'ConnectOneLiner'!BH:BH,0))","v":{"$error":"#N/A"}}]
[null,"Total Net NGL",{"$f":"SUM('ConnectOneLiner'!AD:AD)","v":0},{"$f":"'ConnectOneLiner'!AG96","v":"bbl"},null,null,{"$f":"\"Max Oil Price \"&D31","v":{"$error":"#REF!"}},{"$f":"MAX('ConnectOneLiner'!AH:AH)","v":85.05},{"$f":"INDEX('ConnectOneLiner'!A:A,MATCH(MAX('ConnectOneLiner'!AH:AH),'ConnectOneLiner'!AH:AH,0))","v":"CARVER 1-8-5WH"}]
[null,null,null,null,null,null,{"$f":"\"Max Gas Price \"&D32","v":{"$error":"#REF!"}},{"$f":"MAX('ConnectOneLiner'!AI:AI)","v":5.7290000000000001},{"$f":"INDEX('ConnectOneLiner'!A:A,MATCH(MAX('ConnectOneLiner'!AI:AI),'ConnectOneLiner'!AI:AI,0))","v":"SCRANTON 1-19-31WH"}]
[null,"Revenue and Expenses",null,null,null,null,"Max NGL Price",{"$f":"MAX('ConnectOneLiner'!AJ:AJ)","v":0},{"$f":"INDEX('ConnectOneLiner'!A:A,MATCH(MAX('ConnectOneLiner'!AJ:AJ),'ConnectOneLiner'!AJ:AJ,0))","v":"KLIMEK 10-2H"}]
[null,"Total Net Revenue",{"$f":"SUM('ConnectOneLiner'!AN:AN)","v":368985.21223780519},{"$f":"'ConnectOneLiner'!BF96","v":"M$"},null,null,"Highest Oil Differential %",{"$f":"MAX(#REF!)","v":{"$error":"#REF!"}},{"$f":"INDEX(#REF!,MATCH(MAX(#REF!),#REF!,0))","v":{"$error":"#REF!"}}]
[null,"Total Net Expenses",{"$f":"SUM('ConnectOneLiner'!AU:AU)","v":202490.76921755329},{"$f":"'ConnectOneLiner'!BF96","v":"M$"},null,null,{"$f":"\"Highest Oil Differential \"&D28","v":{"$error":"#REF!"}},{"$f":"MAX(#REF!)","v":{"$error":"#REF!"}},{"$f":"INDEX(#REF!,MATCH(MAX(#REF!),#REF!,0))","v":{"$error":"#REF!"}}]
[null,"Total Net Cashflow",{"$f":"SUM('ConnectOneLiner'!BC:BC)","v":135564.94221197953},{"$f":"'ConnectOneLiner'!BF96","v":"M$"},null,null,"Highest Gas Differential %",{"$f":"MAX(#REF!)","v":{"$error":"#REF!"}},{"$f":"INDEX(#REF!,MATCH(MAX(#REF!),#REF!,0))","v":{"$error":"#REF!"}}]
[null,"Total Primary Discount Cashflow ",{"$f":"SUM('ConnectOneLiner'!BD:BD)","v":92881.278471966609},{"$f":"'ConnectOneLiner'!BF96","v":"M$"},null,null,{"$f":"\"Highest Gas Differential \"&D30","v":{"$error":"#REF!"}},{"$f":"MAX(#REF!)","v":{"$error":"#REF!"}},{"$f":"INDEX(#REF!,MATCH(MAX(#REF!),#REF!,0))","v":{"$error":"#REF!"}}]
[null,"Total Oil Revenue",{"$f":"SUM('ConnectOneLiner'!AK:AK)","v":2140.9402850206257},{"$f":"'ConnectOneLiner'!BF96","v":"M$"},null,null,{"$f":"\"Max Net Investments by Case \"&D12","v":"Max Net Investments by Case M$"},{"$f":"MAX('ConnectOneLiner'!BA:BA)","v":50},{"$f":"INDEX('ConnectOneLiner'!A:A,MATCH(MAX('ConnectOneLiner'!BA:BA),'ConnectOneLiner'!BA:BA,0))","v":"KLIMEK 10-2H"}]
[null,"Total Gas Revenue",{"$f":"SUM('ConnectOneLiner'!AL:AL)","v":366844.27195278456},{"$f":"'ConnectOneLiner'!BF96","v":"M$"},null,null,"Max Shrinkage Value",{"$f":"MAX('ConnectOneLiner'!AA:AA)","v":0},{"$f":"INDEX('ConnectOneLiner'!A:A,MATCH(MAX('ConnectOneLiner'!AA:AA),'ConnectOneLiner'!AA:AA,0))","v":"KLIMEK 10-2H"}]
[null,"Total NGL Revenue",{"$f":"SUM('ConnectOneLiner'!AM:AM)","v":0},{"$f":"'ConnectOneLiner'!BF96","v":"M$"},null,null,"Max Case Multipler",{"$f":"MAX('ConnectOneLiner'!BV:BV)","v":0},{"$f":"INDEX('ConnectOneLiner'!A:A,MATCH(MAX('ConnectOneLiner'!BV:BV),'ConnectOneLiner'!BV:BV,0))","v":"KLIMEK 10-2H"}]
[null,"Total Fixed and Well Costs",{"$f":"(SUM('ConnectOneLiner'!AS:AS)+SUM('ConnectOneLiner'!AT:AT))","v":86517.12231761287},{"$f":"'ConnectOneLiner'!BF96","v":"M$"},null,null,"Max Volume Multiplier",{"$f":"MAX('ConnectOneLiner'!BW:BW)","v":1},{"$f":"INDEX('ConnectOneLiner'!A:A,MATCH(MAX('ConnectOneLiner'!BW:BW),'ConnectOneLiner'!BW:BW,0))","v":"KLIMEK 10-2H"}]
[null,"Total Variable Costs",{"$f":"SUM('ConnectOneLiner'!AR:AR)","v":115973.64689994058},{"$f":"'ConnectOneLiner'!BF96","v":"M$"},null,null,"Max BTU Factor",{"$f":"MAX(#REF!)","v":{"$error":"#REF!"}},{"$f":"INDEX(#REF!,MATCH(MAX(#REF!),#REF!,0))","v":{"$error":"#REF!"}}]
[null,"Total State Taxes",{"$f":"SUM('ConnectOneLiner'!AW:AW)","v":26179.500808272278},{"$f":"'ConnectOneLiner'!BF96","v":"M$"}]
[null,"Total Local Taxes",{"$f":"SUM('ConnectOneLiner'!AV:AV)","v":0},{"$f":"'ConnectOneLiner'!BF96","v":"M$"}]
[null,"Total Abandonment",{"$f":"SUM('ConnectOneLiner'!AZ:AZ)","v":4750},{"$f":"'ConnectOneLiner'!BF96","v":"M$"}]
[null,"Total Net Investments",{"$f":"SUM('ConnectOneLiner'!BA:BA)","v":4750},{"$f":"'ConnectOneLiner'!BF96","v":"M$"}]
[]
[null,"Average Asset Information"]
[null,"Average Oil Differential %",{"$f":"AVERAGE(#REF!)","v":{"$error":"#REF!"}}]
[null,"Average Oil Differential ",{"$f":"AVERAGE(#REF!)","v":{"$error":"#REF!"}},{"$f":"#REF!","v":{"$error":"#REF!"}}]
[null,"Average Gas Differential %",{"$f":"AVERAGE(#REF!)","v":{"$error":"#REF!"}}]
[null,"Average Gas Differential ",{"$f":"AVERAGE(#REF!)","v":{"$error":"#REF!"}},{"$f":"#REF!","v":{"$error":"#REF!"}}]
[null,"Average Oil Price",{"$f":"AVERAGE('ConnectOneLiner'!AH:AH)","v":53.728294736842116},{"$f":"#REF!","v":{"$error":"#REF!"}}]
[null,"Average Gas Price",{"$f":"AVERAGE('ConnectOneLiner'!AI:AI)","v":4.5093473684210537},{"$f":"#REF!","v":{"$error":"#REF!"}}]
[null,"Average BTU Factor",{"$f":"AVERAGE(#REF!)","v":{"$error":"#REF!"}}]
[null,"Average Single Case Net Investment M$",{"$f":"AVERAGE('ConnectOneLiner'!BA:BA)","v":50},{"$f":"'ConnectOneLiner'!BF96","v":"M$"}]
[null,"Average Case Life",{"$f":"AVERAGE('ConnectOneLiner'!BG:BG)","v":12.035044490075286},"Years"]
[null,"Average B Factor",{"$f":"AVERAGE(Projections!M:M)","v":0.34314418449197825}]
[null,"Average Shrinkage Value",{"$f":"AVERAGE('ConnectOneLiner'!AA:AA)","v":0}]
[]
[null,"V2Connect Version 211"]

{"sheet":"ConnectOneLiner","index":2,"n_rows":96,"n_cols":85,"rows_kept":96,"cut":false,"hidden":false,"merged":[]}
["CaseName","UniqueId","Archive","Project","Partner","ReserveClass","ReserveCategory","Field","Reservoir","County","State","OperatorName","PHDWinID","API_Code","Latitude","Longitude","Gradient","TotalDepth","Location","LowerPerf","UpperPerf","CaseType","MajorPhase","GrossOil","GrossGas","GrossNGL","Shrinkage","NetOil","NetGas","NetNGL","OilUnits","GasUnits","NGLUnits","OilPrice","GasPrice","NGLPrice","CoNetRevOil","CoNetRevGas","CoNetRevNGL","AllNetRevenue","OpCost","TransCost","OtherCost","VariableExpense","WellCost","FixedCost","AllNetExpense","NetLocalTax","NetProdTax","NetTanInv","NetInTanInv","NetAbandon","NetInv","NetProfit","NDCash","DiscCash","DiscFactor","RevenueUnits","CaseLife","ECLAfterDate","ECLAfterLink","AsofDate","ECLDate","FirstReversionDate","SecondReversionDate","ROI","DiscROI","DiscPayout","Is_Eco","InitRIOil","InitRIGas","FirstOfWellCnt","LastOfWellCnt","CaseMultiplier","VolumeMultiplier","IDCaseName","IDPHDWinID","API Formatted","API Number","Field Code","Operator Code","PhdWin ID","Retrieval Code","RRC Dist Code","Unique ID"]
["KLIMEK 10-2H","A61BE2A680924536797500002","default","TxWells","All Cases","Proved","Producing","TIGER FLATS SOUTHEAST","MISSISSIPPIAN","OKMULGEE","OK","CALYX ENERGY III LLC",2,"35111274820000",35.522089999999999,-96.019840000000002,0,"7313","N  12.0/E  12.0/SEC  10.0  SW SE SE","6905","3015","Standard Case","Gas",0,0,0,0,0,0,0,"Mbbl","MMcf","bbl",0,0,0,0,0,0,0,0,0,0,0,0,0,0,0,0,0,50,50,50,0,-50,-50,10,"M$",0,null,"Seg1","2022-10-01","2022-10-01",null,null,0,0,0,"False",0.75,0.75,"0","0",0,1,"KLIMEK 10-2H",2,"35-111-27482-0000","35111274820000","049783","269133","00002","23500112157",null,"A61BE2A680924536797500002"]
["CHEATWOOD 15-1HX","A61BE2A680924536797800003","default","TxWells","All Cases","Proved","Producing","BEARDEN EAST","MISSISSIPPIAN","OKFUSKEE","OK","CALYX ENERGY III LLC",3,"35107235710100",35.335889999999999,-96.351939999999999,0,"10146","N  10.0/E  9.0/SEC  15.0  NW SW SW","0","0","Standard Case","Gas",0,327.64292233216651,0,0,0,245.73219174912481,0,"Mbbl","MMcf","bbl",0,4.6260000000000003,0,0,1136.7052919172236,0,1136.7052919172233,0,368.59828762368727,0,368.59828762368716,229.32141067761808,110.85935112936345,708.77904943066869,0,80.649240461527,0,50,50,50,0,297.27700202502774,270.90596546022527,10,"M$",4.4982888432580417,null,"Seg1","2022-10-01","2027-03-31",null,null,6.9455400405005516,9.4777158742833638,0.18617385352498281,"True",0.75,0.75,"1","1",0,1,"CHEATWOOD 15-1HX",3,"35-107-23571-0100","35107235710100","003136","269133","00003","23500112494",null,"A61BE2A680924536797800003"]
["FIELDS 19-1HX","A61BE2A680924536798100004","default","TxWells","All Cases","Proved","Producing","GREASY CREEK","MISSISSIPPIAN","HUGHES","OK","CALYX ENERGY III LLC",4,"35063245930000",35.230919999999998,-96.190690000000004,0,"12258","N  9.0/E  11.0/SEC  30.0  SWNENWNW","12149","3835","Standard Case","Gas",0.24173044467282717,898.57658471565196,0,0,0.18129783350462039,673.93243853673914,0,"Mbbl","MMcf","bbl",63.896999999999998,4.7089999999999996,0,11.584422143367792,3173.8188220599168,0,3185.4032442032849,0.72519133401848135,1010.8986578051085,0,1011.6238491391271,804.86327687620076,389.08979479366769,2205.5769208089955,0,226.004360176223,0,50,50,50,0,703.82196321806612,542.86364350986253,10,"M$",15.778234086242289,null,"Seg1","2022-10-01","2038-07-11",null,null,15.076439264361328,53.239972407978776,4.6543463381245723E-2,"True",0.75,0.75,"1","1",0,1,"FIELDS 19-1HX",4,"35-063-24593-0000","35063245930000","020345","269133","00004","23500112800",null,"A61BE2A680924536798100004"]
["MEADORS 25-1H","A61BE2A680924536798300005","default","TxWells","All Cases","Proved","Producing","GREASY CREEK","MISSISSIPPIAN","HUGHES","OK","CALYX ENERGY III LLC",5,"35063246190000",35.215910000000001,-96.205070000000006,0,"8759","N  9.0/E  10.0/SEC  36.0  SENWNENW","0","0","Standard Case","Gas",1.5455621835978459E-2,17.545465535550242,0,0,1.1591716376983844E-2,13.159099151662684,0,"Mbbl","MMcf","bbl",83.893000000000001,5.2910000000000004,0,0.97246153562227455,69.62857977936703,0,70.601041314989331,4.6366865507935381E-2,19.738648727494027,0,19.785015593001965,25.17741067761807,12.171351129363449,57.133777399983487,0,5.0091438812984928,0,50,50,50,0,-41.541879966292662,-39.329315356730554,10,"M$",0.4982888432580424,null,"Seg1","2022-10-01","2023-03-31",null,null,0.16916240067414692,0.17362206951524872,0,"True",0.75,0.75,"1","1",0,1,"MEADORS 25-1H",5,"35-063-24619-0000","35063246190000","020345","269133","00005","23500112876",null,"A61BE2A680924536798300005"]
["MEADORS 25-2H","A61BE2A680924536798600006","default","TxWells","All Cases","Proved","Producing","GREASY CREEK","MISSISSIPPIAN","HUGHES","OK","CALYX ENERGY III LLC",6,"35063246210000",35.215870000000002,-96.205209999999994,0,"8862","N  9.0/E  10.0/SEC  36.0  SENWNENW","0","0","Standard Case","Gas",0.16166555207591707,252.23234385548454,0,0,0.12124916405693782,189.17425789161342,0,"Mbbl","MMcf","bbl",72.896000000000001,4.601,0,8.8385429691198585,870.41971382805457,0,879.25825679717445,0.48499665622775123,283.7613868374201,0,284.24638349364784,229.32141067761808,110.85935112936345,624.42714530062938,0,62.383373319759528,0,50,50,50,0,142.44773817678555,135.17565553328805,10,"M$",4.4982888432580417,null,"Seg1","2022-10-01","2027-03-31",null,null,3.8489547635357115,5.2301792756183145,0.31485284052019158,"True",0.75,0.75,"1","1",0,1,"MEADORS 25-2H",6,"35-063-24621-0000","35063246210000","020345","269133","00006","23500112877",null,"A61BE2A680924536798600006"]
["MEADORS 36-1HX","A61BE2A680924536799100007","default","TxWells","All Cases","Proved","Producing","GREASY CREEK","MISSISSIPPIAN","HUGHES","OK","CALYX ENERGY III LLC",7,"35063246200000",35.215910000000001,-96.205020000000005,0,"11818","N  9.0/E  10.0/SEC  36.0  SENWNENW","11716","3920","Standard Case","Gas",4.7929751527837669E-2,21.449501810564442,0,0,3.5947313645878255E-2,16.087126357923331,0,"Mbbl","MMcf","bbl",83.903999999999996,5.2809999999999997,0,3.0161218712438886,84.961719112356604,0,87.977840983600501,0.14378925458351302,24.130689536884997,0,24.274478791468518,25.17741067761807,12.171351129363449,61.623240598450039,0,6.2420278177864548,0,50,50,50,0,-29.887427432635995,-27.910176468897848,10,"M$",0.4982888432580424,null,"Seg1","2022-10-01","2023-03-31",null,null,0.40225145134728019,0.41355821578305391,0,"True",0.75,0.75,"1","1",0,1,"MEADORS 36-1HX",7,"35-063-24620-0000","35063246200000","020345","269133","00007","23500112909",null,"A61BE2A680924536799100007"]
["WASHINGTON 2-19-18CH","A61BE2A680924536799500008","default","TxWells","All Cases","Proved","Producing","DUSTIN SOUTH","MISSISSIPPIAN","HUGHES","OK","CALYX ENERGY III LLC",8,"35063246520000",35.232259999999997,-96.076059999999998,0,"12330","N  9.0/E  12.0/SEC  19.0  SWSESWSE","0","0","Standard Case","Gas",0.2140623972354006,219.28146091239913,0,0,0.16054679792655044,164.46109568429929,0,"Mbbl","MMcf","bbl",67.165999999999997,4.6959999999999997,0,10.783338943719873,772.30681133964219,0,783.09015028336194,0.64218719170620187,246.69164352644898,0,247.33383071815513,178.28541067761807,86.187351129363449,511.80659252513664,0,55.560246162604528,0,50,50,50,0,165.72331159562071,159.11176957207937,10,"M$",3.4989733059548249,null,"Seg1","2022-10-01","2026-03-31",null,null,4.3144662319124167,5.5075723489239108,0.2491444216290212,"True",0.75,0.75,"1","1",0,1,"WASHINGTON 2-19-18CH",8,"35-063-24652-0000","35063246520000","014393","269133","00008","23500113057",null,"A61BE2A680924536799500008"]
["WASHINGTON 1-19-18WH","A61BE2A680924536799900009","default","TxWells","All Cases","Proved","Producing","DUSTIN SOUTH","WOODFORD","HUGHES","OK","CALYX ENERGY III LLC",9,"35063246530000",35.232259999999997,-96.075959999999995,0,"13100","N  9.0/E  12.0/SEC  19.0  SWSESWSE","12959","4469","Standard Case","Gas",5.3941725799799653E-2,123.7830090489431,0,0,4.045629434984975E-2,92.837256786707314,0,"Mbbl","MMcf","bbl",79.741,4.9720000000000004,0,3.2260304064733067,461.6173219274574,0,464.84335233393068,0.161825177399399,139.25588518006094,0,139.41771035746035,80.40527926078029,38.869798767967147,258.69278838620778,0,32.980635848092383,0,50,50,50,0,123.16992809963051,121.77160771392022,10,"M$",1.579739904175222,null,"Seg1","2022-10-01","2024-04-29",null,null,3.4633985619926095,3.8495781501409145,0.20260095824777541,"True",0.75,0.75,"1","1",0,1,"WASHINGTON 1-19-18WH",9,"35-063-24653-0000","35063246530000","014393","269133","00009","23500113079",null,"A61BE2A680924536799900009"]
["ADAMS 2-36-25CH","A61BE2A680924536800400010","default","TxWells","All Cases","Proved","Producing","CARSON","MISSISSIPPIAN","HUGHES","OK","CALYX ENERGY III LLC",10,"35063246930000",35.205440000000003,-96.104119999999995,0,"13435","N  9.0/E  11.0/SEC  36.0  SWNWSWSW","0","0","Standard Case","Gas",2.4622122884791067E-2,2189.030102018346,0,0,1.8466592163593299E-2,1641.7725765137595,0,"Mbbl","MMcf","bbl",82.031000000000006,4.7329999999999997,0,1.5148363668853551,7770.3581473604308,0,7771.8729837273177,7.3866368654373196E-2,2462.658864770639,0,2462.7327311392937,1053.3819244220711,509.22954070345122,4025.3441962648158,0,551.41438819545306,0,50,50,50,0,3145.1143992670486,1980.8683656162293,10,"M$",20.646132785763172,null,"Seg1","2022-10-01","2043-05-24",null,null,63.902287985340983,310.5294244434325,1.3689253935660501E-2,"True",0.75,0.75,"1","1",0,1,"ADAMS 2-36-25CH",10,"35-063-24693-0000","35063246930000","008500","269133","00010","23500113318",null,"A61BE2A680924536800400010"]
["ADAMS 1-36-25WH","A61BE2A680924536802100011","default","TxWells","All Cases","Proved","Producing","CARSON","WOODFORD","HUGHES","OK","CALYX ENERGY III LLC",11,"35063246910000",35.205359999999999,-96.104119999999995,0,"14080","N  9.0/E  11.0/SEC  36.0  SWNWSWSW","0","0","Standard Case","Gas",0.13234777285878649,1385.9426114211078,0,0,9.9260829644089874E-2,1039.456958565831,0,"Mbbl","MMcf","bbl",76.004000000000005,4.601,0,7.5442475008686873,4782.3862277334183,0,4789.9304752342869,0.39704331857635944,1559.1854378487462,0,1559.5824811673222,602.63998655361991,291.33031092269988,2453.5527786436419,0,339.8455672178726,0,50,50,50,0,1946.5321293727723,1516.41316268279,10,"M$",11.81656399726214,null,"Seg1","2022-10-01","2034-07-25",null,null,39.930642587455438,99.353430279613718,2.7378507871321012E-2,"True",0.75,0.75,"1","1",0,1,"ADAMS 1-36-25WH",11,"35-063-24691-0000","35063246910000","008500","269133","00011","23500113319",null,"A61BE2A680924536802100011"]
["ADAMS 1-35-26WH","A61BE2A680924536802700012","default","TxWells","All Cases","Proved","Producing","CARSON","WOODFORD","HUGHES","OK","CALYX ENERGY III LLC",12,"35063246940000",35.205399999999997,-96.104119999999995,0,"13528","N  9.0/E  11.0/SEC  36.0  SWNWSWSW","0","0","Standard Case","Gas",3.2141779327728166,2619.5827352991059,0,0,2.4106334495796129,1964.6870514743291,0,"Mbbl","MMcf","bbl",61.143999999999998,4.7450000000000001,0,147.39656814751072,9322.9644360800285,0,9470.3610042275413,9.6425337983184498,2947.0305772114943,0,2956.6731110098135,1147.9694106776187,554.95535112936363,4659.5978728167956,0,671.922113249944,0,50,50,50,0,4088.8410181608019,2496.8353898029568,10,"M$",22.499657768651598,null,"Seg1","2022-10-01","2045-03-31",null,null,82.776820363215961,470.24564165507854,8.2135523613963042E-3,"True",0.75,0.75,"1","1",0,1,"ADAMS 1-35-26WH",12,"35-063-24694-0000","35063246940000","008500","269133","00012","23500113320",null,"A61BE2A680924536802700012"]
["JEFFERSON 1-29-32WH","A61BE2A680924536803400013","default","TxWells","All Cases","Proved","Producing","DUSTIN","WOODFORD","HUGHES","OK","CALYX ENERGY III LLC",13,"35063247030000",35.23254,-96.068470000000005,0,"12229","N  9.0/E  12.0/SEC  20.0  S2SWSWSW","0","0","Standard Case","Gas",0,874.54691804569188,0,0,0,655.91018853426885,0,"Mbbl","MMcf","bbl",0,4.7229999999999999,0,0,3097.6314587082029,0,3097.6314587082029,0,983.86528280140328,0,983.86528280140283,829.60938709677441,401.05264516129046,2214.5273150594676,0,219.77695199534699,0,50,50,50,0,613.32719165338801,466.7625943547236,10,"M$",16.257357973990409,null,"Seg1","2022-10-01","2039-01-02",null,null,13.266543833067749,48.111842685512293,5.2019164955509921E-2,"True",0.75,0.75,"1","1",0,1,"JEFFERSON 1-29-32WH",13,"35-063-24703-0000","35063247030000","014390","269133","00013","23500113321",null,"A61BE2A680924536803400013"]
["JEFFERSON 1-20-17WH","A61BE2A680924536803700014","default","TxWells","All Cases","Proved","Producing","DUSTIN","WOODFORD","HUGHES","OK","CALYX ENERGY III LLC",14,"35063247010000",35.23254,-96.068569999999994,0,"14105","N  9.0/E  12.0/SEC  20.0  SWSWSWSW","0","0","Standard Case","Gas",4.6211211234213345E-2,2971.7342113541144,0,0,3.4658408425660002E-2,2228.8006585155854,0,"Mbbl","MMcf","bbl",80.397999999999996,4.9059999999999997,0,2.7864506302552425,10934.633614678165,0,10937.420065308421,0.13863363370264001,3343.200987773379,0,3343.3396214070799,1824.0741478439438,881.80024640657143,6049.2140156575952,0,776.00995363363222,0,50,50,50,0,4062.1960960171932,1990.2730504051185,10,"M$",35.748117727583839,null,"Seg1","2022-10-01","2058-06-30",null,null,82.243921920343737,1400.3042443377753,2.7378507871321013E-3,"True",0.75,0.75,"1","1",0,1,"JEFFERSON 1-20-17WH",14,"35-063-24701-0000","35063247010000","014390","269133","00014","23500113322",null,"A61BE2A680924536803700014"]
["JEFFERSON 2-20-17CH","A61BE2A680924536804000015","default","TxWells","All Cases","Proved","Producing","DUSTIN","MISSISSIPPIAN","HUGHES","OK","CALYX ENERGY III LLC",15,"35063247020000",35.23254,-96.068520000000007,0,"13760","N  9.0/E  12.0/SEC  20.0  SWSWSWSW","0","0","Standard Case","Gas",0,930.77222104447594,0,0,0,698.07916578335721,0,"Mbbl","MMcf","bbl",0,4.7060000000000004,0,0,3284.9930129324703,0,3284.9930129324689,0,1047.1187486750357,0,1047.1187486750346,806.64679300523301,389.95198834205485,2243.7175300223225,0,233.07025426755871,0,50,50,50,0,758.20522864258783,577.0678075993045,10,"M$",15.813826146475011,null,"Seg1","2022-10-01","2038-07-24",null,null,16.164104572851766,56.728630101921816,4.380561259411362E-2,"True",0.75,0.75,"1","1",0,1,"JEFFERSON 2-20-17CH",15,"35-063-24702-0000","35063247020000","014390","269133","00015","23500113323",null,"A61BE2A680924536804000015"]
["GRANT 2-2-35WH","A61BE2A680924536804400016","default","TxWells","All Cases","Proved","Producing","CARSON","WOODFORD","HUGHES","OK","CALYX ENERGY III LLC",16,"35063247270000",35.191099999999999,-96.013109999999998,0,"14154","N  8.0/E  12.0/SEC  2.0  SW","0","0","Standard Case","Gas",0,884.23338254209602,0,0,0,663.1750369065719,0,"Mbbl","MMcf","bbl",0,4.6790000000000003,0,0,3102.9565590801153,0,3102.9565590801162,0,994.76255535985797,0,994.76255535985752,745.38240829303845,360.33534715506397,2100.48031080796,0,220.15476786673423,0,50,50,50,0,732.32148040542199,575.69589237096034,10,"M$",14.611909650924019,null,"Seg1","2022-10-01","2037-05-11",null,null,15.646429608108436,50.324463937184831,4.9281314168377818E-2,"True",0.75,0.75,"1","1",0,1,"GRANT 2-2-35WH",16,"35-063-24727-0000","35063247270000","008500","269133","00016","23500113384",null,"A61BE2A680924536804400016"]
["GRANT 1-2-35WH","A61BE2A680924536804700017","default","TxWells","All Cases","Proved","Producing","CARSON","WOODFORD","HUGHES","OK","CALYX ENERGY III LLC",17,"35063247260000",35.191049999999997,-96.013120000000001,0,"13936","N  8.0/E  12.0/SEC  2.0  SW","0","0","Standard Case","Gas",0,0,0,0,0,0,0,"Mbbl","MMcf","bbl",0,0,0,0,0,0,0,0,0,0,0,0,0,0,0,0,0,50,50,50,0,-50,-50,10,"M$",0,null,"Seg1","2022-10-01","2022-10-01",null,null,0,0,0,"False",0.75,0.75,"0","0",0,1,"GRANT 1-2-35WH",17,"35-063-24726-0000","35063247260000","008500","269133","00017","23500113406",null,"A61BE2A680924536804700017"]
["CARVER 1-8-5WH","A61BE2A680924536805100018","default","TxWells","All Cases","Proved","Producing","DUSTIN","MISSISSIPPIAN","HUGHES","OK","CALYX ENERGY III LLC",18,"35063247450000",35.260289999999998,-96.051310000000001,0,"14454","N  9.0/E  12.0/SEC  16.0  NWNWNWNW","0","0","Standard Case","Gas",1.7362683978267416E-3,0.67499470432581543,0,0,1.3022012983700561E-3,0.5062460282443616,0,"Mbbl","MMcf","bbl",85.05,4.9589999999999996,0,0.11075222042637327,2.5104740540637889,0,2.6212262744901573,5.2088051934802244E-3,0.75936904236654235,0,0.76457784756002267,1.0975483870967739,0.53058064516129022,2.3927068798180868,0,0.18597600417507701,0,50,50,50,0,-49.957456609503005,-49.8621662766746,10,"M$",2.190280629705681E-2,null,"Seg1","2022-10-01","2022-10-08",null,null,8.5086780993997311E-4,8.5156406352365906E-4,0,"True",0.75,0.75,"1","1",0,1,"CARVER 1-8-5WH",18,"35-063-24745-0000","35063247450000","014390","269133","00018","23500113418",null,"A61BE2A680924536805100018"]
["CARVER 1-9-4WH","A61BE2A680924536805400019","default","TxWells","All Cases","Proved","Producing","DUSTIN","WOODFORD","HUGHES","OK","CALYX ENERGY III LLC",19,"35063247470000",35.260620000000003,-96.050939999999997,0,"14421","N  9.0/E  12.0/SEC  16.0  NWNWNWNW","0","0","Standard Case","Gas",0.82954130796924752,1428.0934376117257,0,0,0.6221559809769357,1071.0700782087945,0,"Mbbl","MMcf","bbl",62.752000000000002,3.7360000000000002,0,39.04166689905022,4001.7401775425042,0,4040.7818444415543,2.4886239239077419,1606.6051173131914,0,1609.093741237099,892.79194608200339,431.59657680333856,2933.4822641224409,0,286.69347186312825,0,50,50,50,0,770.60610845598512,518.47548377495002,10,"M$",17.497604380561249,null,"Seg1","2022-10-01","2040-03-30",null,null,16.412122169119684,60.210986612612444,5.2019164955509921E-2,"True",0.75,0.75,"1","1",0,1,"CARVER 1-9-4WH",19,"35-063-24747-0000","35063247470000","014390","269133","00019","23500113419",null,"A61BE2A680924536805400019"]
["CARVER 1-16-21WH","A61BE2A680924536805700020","default","TxWells","All Cases","Proved","Producing","DUSTIN","WOODFORD","HUGHES","OK","CALYX ENERGY III LLC",20,"35063247460000",35.2607,-96.050939999999997,0,"13880","N  9.0/E  12.0/SEC  16.0  NWNWNWNW","0","0","Standard Case","Gas",0.5342653975690711,1001.4553858475023,0,0,0.40069904817680335,751.09153938562679,0,"Mbbl","MMcf","bbl",64.988,4.6680000000000001,0,26.040804282787811,3506.0261926046701,0,3532.0669968874586,1.6027961927072132,1126.63730907844,0,1128.2401052711475,740.65951334702277,358.05218891170438,2226.9518075298747,0,250.60015342916512,0,50,50,50,0,1004.5150359284189,775.38156042183539,10,"M$",14.518822724161531,null,"Seg1","2022-10-01","2037-04-07",null,null,21.090300718568368,66.820132123692929,3.8329911019849408E-2,"True",0.75,0.75,"1","1",0,1,"CARVER 1-16-21WH",20,"35-063-24746-0000","35063247460000","014390","269133","00020","23500113420",null,"A61BE2A680924536805700020"]
["BARGER 1-26-23CH","A61BE2A680924536806000021","default","TxWells","All Cases","Proved","Producing","GREASY CREEK","MISSISSIPPIAN","HUGHES","OK","CALYX ENERGY III LLC",21,"35063246770000",35.216670000000001,-96.22672,0,"14111","N  9.0/E  10.0/SEC  35.0  NENWNWNW","0","0","Standard Case","Gas",3.771407585368132E-2,858.1805622128802,0,0,2.828555689026099E-2,643.63542165966032,0,"Mbbl","MMcf","bbl",80.632999999999996,4.7119999999999997,0,2.2807515676408312,3032.8672333912514,0,3035.1479849588923,0.11314222756104397,965.45313248949026,0,965.5662747170511,805.13766397297502,389.22243995495802,2159.9263786449842,0,215.34374953283339,0,50,50,50,0,609.87785678107468,471.5254506118676,10,"M$",15.78370978781656,null,"Seg1","2022-10-01","2038-07-13",null,null,13.197557135621496,46.399821127300442,5.2019164955509921E-2,"True",0.75,0.75,"1","1",0,1,"BARGER 1-26-23CH",21,"35-063-24677-0000","35063246770000","020345","269133","00021","23500113471",null,"A61BE2A680924536806000021"]
["BARGER EAST 1-35-2CH","A61BE2A680924536806500022","default","TxWells","All Cases","Proved","Producing","GREASY CREEK","MISSISSIPPIAN","HUGHES","OK","CALYX ENERGY III LLC",22,"35063247550000",35.216679999999997,-96.226820000000004,0,"13511","N  9.0/E  10.0/SEC  35.0  NENWNWNW","0","0","Standard Case","Gas",0,1327.1444707311309,0,0,0,995.35835304834836,0,"Mbbl","MMcf","bbl",0,4.7830000000000004,0,0,4760.9113344215093,0,4760.9113344215084,0,1493.0375295725221,0,1493.0375295725216,1070.5333716632449,517.52095277207411,3081.0918540078405,0,337.78665917720605,0,50,50,50,0,1292.0328212364618,862.68029104732545,10,"M$",20.985626283367552,null,"Seg1","2022-10-01","2043-09-25",null,null,26.84065642472925,140.43735018220636,2.190280629705681E-2,"True",0.75,0.75,"1","1",0,1,"BARGER EAST 1-35-2CH",22,"35-063-24755-0000","35063247550000","020345","269133","00022","23500113472",null,"A61BE2A680924536806500022"]
["MADISON 1-23-14WH","A61BE2A680924536806800023","default","TxWells","All Cases","Proved","Producing","DUSTIN WEST","WOODFORD","HUGHES","OK","CALYX ENERGY III LLC",23,"35063247620000",35.233870000000003,-96.105789999999999,0,"13726","N  9.0/E  11.0/SEC  23.0  SENESESE","0","0","Standard Case","Gas",1.5932675596227455E-3,1628.4756109579805,0,0,1.1949506697170591E-3,1221.3567082184854,0,"Mbbl","MMcf","bbl",85.05,4.8259999999999996,0,0.10163055445943588,5894.1089014508643,0,5894.2105320053233,4.7798026788682365E-3,1832.0350623277282,0,1832.0398421304053,1275.9247906206538,616.81198436775549,3724.7766171188146,0,418.19423724577769,0,50,50,50,0,1701.2396776407304,1078.7368407168037,10,"M$",25.010266940451739,null,"Seg1","2022-10-01","2047-10-04",null,null,35.024793552814629,261.32052802284983,1.3689253935660501E-2,"True",0.75,0.75,"1","1",0,1,"MADISON 1-23-14WH",23,"35-063-24762-0000","35063247620000","014395","269133","00023","23500113575",null,"A61BE2A680924536806800023"]
["MADISON 1-24-13WH","A61BE2A680924536807100024","default","TxWells","All Cases","Proved","Producing","DUSTIN WEST","WOODFORD","HUGHES","OK","CALYX ENERGY III LLC",24,"35063247730000",35.234000000000002,-96.105779999999996,0,"13779","N  9.0/E  11.0/SEC  23.0  SENESESE","0","0","Standard Case","Gas",3.539732927248565E-2,123.88072659026747,0,0,2.6547996954364241E-2,92.910544942700611,0,"Mbbl","MMcf","bbl",77.790999999999997,4.8630000000000004,0,2.0651988238087422,451.83896836781781,0,453.90416719162647,0.10619198781745696,139.36581741405089,0,139.47200940186835,96.398328409617818,46.601214016029672,282.47155182751584,0,32.204500662245906,0,50,50,50,0,89.228114701864769,89.870153390013883,10,"M$",1.8973305954825459,null,"Seg1","2022-10-01","2024-08-23",null,null,2.7845622940372965,3.1706292495493602,0.27652292950034218,"True",0.75,0.75,"1","1",0,1,"MADISON 1-24-13WH",24,"35-063-24773-0000","35063247730000","014395","269133","00024","23500113576",null,"A61BE2A680924536807100024"]
["MADISON 2-23-14CH","A61BE2A680924536807300025","default","TxWells","All Cases","Proved","Producing","DUSTIN WEST","MISSISSIPPIAN","HUGHES","OK","CALYX ENERGY III LLC",25,"35063247710000",35.233910000000002,-96.105789999999999,0,"13392","N  9.0/E  11.0/SEC  23.0  SENESESE","0","0","Standard Case","Gas",0,2167.6550817789648,0,0,0,1625.7413113342238,0,"Mbbl","MMcf","bbl",0,4.6929999999999996,0,0,7628.8603466953591,0,7628.8603466953573,0,2438.6119670013359,0,2438.611967001335,937.19701848049317,453.06303080082154,3828.8720162826494,0,541.26764159803554,0,50,50,50,0,3208.720688814672,2148.2509369228892,10,"M$",18.368240930869259,null,"Seg1","2022-10-01","2041-02-11",null,null,65.174413776293477,268.55536871007052,1.3689253935660501E-2,"True",0.75,0.75,"1","1",0,1,"MADISON 2-23-14CH",25,"35-063-24771-0000","35063247710000","014395","269133","00025","23500113577",null,"A61BE2A680924536807300025"]
["MADISON 2-24-13CH","A61BE2A680924536807600026","default","TxWells","All Cases","Proved","Producing","DUSTIN WEST","MISSISSIPPIAN","HUGHES","OK","CALYX ENERGY III LLC",26,"35063247720000",35.23395,-96.105779999999996,0,"13414","N  9.0/E  11.0/SEC  23.0  SENESESE","0","0","Standard Case","Gas",0,514.6954106109448,0,0,0,386.02155795820858,0,"Mbbl","MMcf","bbl",0,4.6100000000000003,0,0,1779.4109733396547,0,1779.4109733396549,0,579.03233693731295,0,579.03233693731295,280.49713963039017,135.59889938398356,995.12837595168662,0,126.24920855844852,0,50,50,50,0,608.03338882951971,538.21023707192001,10,"M$",5.500342231348391,null,"Seg1","2022-10-01","2028-03-31",null,null,13.160667776590399,19.610178646866167,9.3086926762491445E-2,"True",0.75,0.75,"1","1",0,1,"MADISON 2-24-13CH",26,"35-063-24772-0000","35063247720000","014395","269133","00026","23500113578",null,"A61BE2A680924536807600026"]
["LINCOLN 1-13-12WH","A61BE2A680924536807800027","default","TxWells","All Cases","Proved","Producing","CARSON","WOODFORD","HUGHES","OK","CALYX ENERGY III LLC",27,"35063247680000",35.160170000000001,-96.002229999999997,0,"14838","N  8.0/E  12.0/SEC  14.0  SWSESESE","0","0","Standard Case","Gas",0,3181.2439536172874,0,0,0,2385.9329652129663,0,"Mbbl","MMcf","bbl",0,4.7530000000000001,0,0,11339.405254142175,0,11339.405254142173,0,3578.8994478194481,0,3578.899447819445,1216.855502682653,588.25650447108717,5384.0114549731852,0,804.53080278138748,0,50,50,50,0,5100.862996387601,3050.8840518113725,10,"M$",23.852156057494859,null,"Seg1","2022-10-01","2046-08-07",null,null,103.01725992775211,657.04087899186061,8.2135523613963042E-3,"True",0.75,0.75,"1","1",0,1,"LINCOLN 1-13-12WH",27,"35-063-24768-0000","35063247680000","008500","269133","00027","23500113704",null,"A61BE2A680924536807800027"]
["LINCOLN 1-14-11WH","A61BE2A680924536809600028","default","TxWells","All Cases","Proved","Producing","CARSON","WOODFORD","HUGHES","OK","CALYX ENERGY III LLC",28,"35063247690000",35.160150000000002,-96.002330000000001,0,"14870","N  8.0/E  12.0/SEC  14.0  SWSESESE","0","0","Standard Case","Gas",0,373.09344856496284,0,0,0,279.8200864237221,0,"Mbbl","MMcf","bbl",0,4.5720000000000001,0,0,1279.3305966276605,0,1279.3305966276605,0,419.73012963558324,0,419.73012963558324,284.68900821355237,137.62534702258725,842.04448487172283,0,90.768505830732508,0,50,50,50,0,296.5176059252052,267.78091674071658,10,"M$",5.5824777549623539,null,"Seg1","2022-10-01","2028-04-30",null,null,6.9303521185041044,10.335348422220477,0.17796030116358649,"True",0.75,0.75,"1","1",0,1,"LINCOLN 1-14-11WH",28,"35-063-24769-0000","35063247690000","008500","269133","00028","23500113709",null,"A61BE2A680924536809600028"]
["THUNDER 1-18-6MH","A61BE2A680924536809900029","default","TxWells","All Cases","Proved","Producing","PAPOOSE","MISSISSIPPIAN","HUGHES","OK","CALYX ENERGY III LLC",29,"35063248150000",35.257399999999997,-96.298749999999998,0,"15281","N  9.0/E  10.0/SEC  18.0  SWSWNWNW","0","0","Standard Case","Gas",0,0,0,0,0,0,0,"Mbbl","MMcf","bbl",0,0,0,0,0,0,0,0,0,0,0,0,0,0,0,0,0,50,50,50,0,-50,-50,10,"M$",0,null,"Seg1","2022-10-01","2022-10-01",null,null,0,0,0,"False",0.75,0.75,"0","0",0,1,"THUNDER 1-18-6MH",29,"35-063-24815-0000","35063248150000","037776","269133","00029","23500113710",null,"A61BE2A680924536809900029"]
["LINCOLN 1-23-26WH","A61BE2A680924536810200030","default","TxWells","All Cases","Proved","Producing","CARSON","WOODFORD","HUGHES","OK","CALYX ENERGY III LLC",30,"35063247670000",35.160159999999998,-96.002279999999999,0,"15477","N  8.0/E  12.0/SEC  14.0  SWSESESE","0","0","Standard Case","Gas",0,2875.4559706463656,0,0,0,2156.5919779847745,0,"Mbbl","MMcf","bbl",0,4.8209999999999997,0,0,10397.225356607283,0,10397.225356607281,0,3234.8879669771618,0,3234.8879669771609,1414.2491293634505,683.6812156057498,5332.8183119463611,0,737.68313905128673,0,50,50,50,0,4276.7239056096341,2301.8080204161383,10,"M$",27.718001368925389,null,"Seg1","2022-10-01","2050-06-19",null,null,86.534478112192616,728.39471450523774,8.2135523613963042E-3,"True",0.75,0.75,"1","1",0,1,"LINCOLN 1-23-26WH",30,"35-063-24767-0000","35063247670000","008500","269133","00030","23500113711",null,"A61BE2A680924536810200030"]
["LINCOLN 1-24-25WH","A61BE2A680924536810800031","default","TxWells","All Cases","Proved","Producing","CARSON","WOODFORD","HUGHES","OK","CALYX ENERGY III LLC",31,"35063247660000",35.160179999999997,-96.002179999999996,0,"15354","N  8.0/E  12.0/SEC  14.0  SWSESESE","0","0","Standard Case","Gas",0.2838906324521856,319.90867681269532,0,0,0.2129179743391392,239.93150760952147,0,"Mbbl","MMcf","bbl",75.772000000000006,4.7560000000000002,0,16.133321776925822,1141.0241039380307,0,1157.1574257149564,0.85167189735655668,359.89726141428224,0,360.74893331163872,176.91347519374713,85.524125322911829,623.18653382829768,0,82.10031935447617,0,50,50,50,0,401.87057253218262,378.42700724448321,10,"M$",3.4715947980835038,null,"Seg1","2022-10-01","2026-03-21",null,null,9.0374114506436527,11.691494501808807,0.1013004791238877,"True",0.75,0.75,"1","1",0,1,"LINCOLN 1-24-25WH",31,"35-063-24766-0000","35063247660000","008500","269133","00031","23500113712",null,"A61BE2A680924536810800031"]
["THUNDER 1-13-25CH","A61BE2A680924536811300032","default","TxWells","All Cases","Proved","Producing","GILCREASE DISTRICT EAST","MISSISSIPPIAN","HUGHES","OK","CALYX ENERGY III LLC",32,"35063248140000",35.257280000000002,-96.298749999999998,0,"16149","N  9.0/E  10.0/SEC  18.0  SWNWSWNW","0","0","Standard Case","Gas",0,137.01857084575832,0,0,0,102.76392813431872,0,"Mbbl","MMcf","bbl",0,4.8630000000000004,0,0,499.69903363775023,0,499.69903363775023,0,154.14589220147806,0,154.14589220147809,98.194521560574955,47.469535934291585,299.80994969634463,0,35.453646436598376,0,50,50,50,0,114.43543750480725,113.78636340521274,10,"M$",1.932922655715263,null,"Seg1","2022-10-01","2024-09-05",null,null,3.2887087500961449,3.7580346885146989,0.2354551676933607,"True",0.75,0.75,"1","1",0,1,"THUNDER 1-13-25CH",32,"35-063-24814-0000","35063248140000","056766","269133","00032","23500113719",null,"A61BE2A680924536811300032"]
["THUNDER 1-18-30CH","A61BE2A680924536811700033","default","TxWells","All Cases","Proved","Producing","GREASY CREEK","MISSISSIPPIAN","HUGHES","OK","CALYX ENERGY III LLC",33,"35063248130000",35.25732,-96.298749999999998,0,"15570","N  9.0/E  10.0/SEC  18.0  SWSWNWNW","0","0","Standard Case","Gas",0.4477688908202585,1661.735494565818,0,0,0.33582666811519385,1246.3016209243633,0,"Mbbl","MMcf","bbl",70.090999999999994,4.8529999999999998,0,23.538335621422139,6048.5540706876518,0,6072.0924063090733,1.3433066724607756,1869.4524313865452,0,1870.7957380590051,1373.6753347022595,664.06689117043152,3908.5379639316961,0,430.81495622762867,0,50,50,50,0,1682.7394861497485,1012.948930647378,10,"M$",26.926762491444212,null,"Seg1","2022-10-01","2049-09-03",null,null,34.654789722994984,296.8475066179663,1.09514031485284E-2,"True",0.75,0.75,"1","1",0,1,"THUNDER 1-18-30CH",33,"35-063-24813-0000","35063248130000","020345","269133","00033","23500113720",null,"A61BE2A680924536811700033"]
["TRUMAN 4-19-18CH","A61BE2A680924536812000034","default","TxWells","All Cases","Proved","Producing","DUSTIN","MISSISSIPPIAN","HUGHES","OK","CALYX ENERGY III LLC",34,"35063248430000",35.230910000000002,-96.081940000000003,0,"14405","N  9.0/E  12.0/SEC  30.0  NW","0","0","Standard Case","Gas",0,1107.9147919239056,0,0,0,830.93609394292923,0,"Mbbl","MMcf","bbl",0,4.5890000000000004,0,0,3812.7661125173508,0,3812.7661125173504,0,1246.4041409143936,0,1246.4041409143938,555.99418010200702,268.78063350334503,2071.1789545197457,0,270.51575568310602,0,50,50,50,0,1421.071402314499,1125.4512036620349,10,"M$",10.90485968514715,null,"Seg1","2022-10-01","2033-08-26",null,null,29.421428046289986,67.660395843398618,3.8329911019849408E-2,"True",0.75,0.75,"1","1",0,1,"TRUMAN 4-19-18CH",34,"35-063-24843-0000","35063248430000","014390","269133","00034","23500113721",null,"A61BE2A680924536812000034"]
["TRUMAN 3-19-18CH","A61BE2A680924536813900035","default","TxWells","All Cases","Proved","Producing","DUSTIN","MISSISSIPPIAN","HUGHES","OK","CALYX ENERGY III LLC",35,"35063248420000",35.230910000000002,-96.082040000000006,0,"14624","N  9.0/E  12.0/SEC  30.0  NW","0","0","Standard Case","Gas",4.159266436772651E-3,1476.1658949790697,0,0,3.1194498275794878E-3,1107.1244212343022,0,"Mbbl","MMcf","bbl",85.05,4.6310000000000002,0,0.26530920783563539,5127.4705630650369,0,5127.7358722728723,1.2477799310317951E-2,1660.6866318514531,0,1660.6991096507638,710.76625051334713,343.60108418891178,2715.0664443530227,0,363.81286013776037,0,50,50,50,0,1998.8565677820898,1489.6701999313136,10,"M$",13.935660506502391,null,"Seg1","2022-10-01","2036-09-06",null,null,40.977131355641788,120.31964204807153,2.4640657084188909E-2,"True",0.75,0.75,"1","1",0,1,"TRUMAN 3-19-18CH",35,"35-063-24842-0000","35063248420000","014390","269133","00035","23500113722",null,"A61BE2A680924536813900035"]
["THUNDER 1-13-1CH","A61BE2A680924536814400036","default","TxWells","All Cases","Proved","Producing","PAPOOSE","MISSISSIPPIAN","HUGHES","OK","CALYX ENERGY III LLC",36,"35063248170000",35.257359999999998,-96.298749999999998,0,"15306","N  9.0/E  10.0/SEC  18.0  SWSWNWNW","0","0","Standard Case","Gas",8.8416323513249822,1238.8929108797665,0,0,6.6312242634937393,929.1696831598249,0,"Mbbl","MMcf","bbl",64.435000000000002,4.6989999999999998,0,427.28595308274851,4365.8488233444004,0,4793.1347764271486,26.524897053974957,1393.7545247397377,0,1420.2794217937119,854.93892203749112,413.2975367291516,2688.5158805603546,0,340.07291238750622,0,50,50,50,0,1714.5459834792875,1251.7639863292661,10,"M$",16.758384668035589,null,"Seg1","2022-10-01","2039-07-04",null,null,35.290919669585755,133.80843170327202,2.190280629705681E-2,"True",0.75,0.75,"1","1",0,1,"THUNDER 1-13-1CH",36,"35-063-24817-0000","35063248170000","037776","269133","00036","23500113723",null,"A61BE2A680924536814400036"]
["ROOSEVELT 1-5-18WH","A61BE2A680924536814700037","default","TxWells","All Cases","Proved","Producing","CARSON","WOODFORD","HUGHES","OK","CALYX ENERGY III LLC",37,"35063248240000",35.191330000000001,-96.056359999999998,0,"15378","N  8.0/E  12.0/SEC  5.0  NENWSESE","0","0","Standard Case","Gas",0.37037295640363826,159.55813560842103,0,0,0.27777971730272866,119.66860170631578,0,"Mbbl","MMcf","bbl",76.122,4.8109999999999999,0,21.145162334836126,575.74419468959582,0,596.889357024432,1.1111188692109146,179.50290255947365,0,180.61402142868451,127.24941067761807,61.515351129363452,369.37878323566605,0,42.349299880883457,0,50,50,50,0,135.16127390788247,132.19766710324643,10,"M$",2.4996577686516082,null,"Seg1","2022-10-01","2025-03-31",null,null,3.7032254781576492,4.3903481919929597,0.24366872005475701,"True",0.75,0.75,"1","1",0,1,"ROOSEVELT 1-5-18WH",37,"35-063-24824-0000","35063248240000","008500","269133","00037","23500113861",null,"A61BE2A680924536814700037"]
["ROOSEVELT 2-5-18WH","A61BE2A680924536815000038","default","TxWells","All Cases","Proved","Producing","CARSON","WOODFORD","HUGHES","OK","CALYX ENERGY III LLC",38,"35063248250000",35.191330000000001,-96.05641,0,"17005","N  8.0/E  12.0/SEC  5.0  SE","0","0","Standard Case","Gas",3.1978960731979917,993.01142029558525,0,0,2.3984220548984938,744.75856522168897,0,"Mbbl","MMcf","bbl",72.426000000000002,4.6829999999999998,0,173.70829371373679,3488.0035482617336,0,3661.7118419754711,9.5936882195939734,1117.1378478325335,0,1126.7315360521275,756.43395429555551,365.67792382592575,2248.8434141736088,0,259.79845518815961,0,50,50,50,0,1103.0699726137025,875.6017876683236,10,"M$",14.83093771389459,null,"Seg1","2022-10-01","2037-07-30",null,null,23.061399452274035,77.674108504765485,2.7378507871321012E-2,"True",0.75,0.75,"1","1",0,1,"ROOSEVELT 2-5-18WH",38,"35-063-24825-0000","35063248250000","008500","269133","00038","23500113864",null,"A61BE2A680924536815000038"]
["ROOSEVELT 3-5-18CH","A61BE2A680924536815200039","default","TxWells","All Cases","Proved","Producing","CARSON","CANEY","HUGHES","OK","CALYX ENERGY III LLC",39,"35063248260000",35.191330000000001,-96.056460000000001,0,"15992","N  8.0/E  12.0/SEC  5.0  SE","0","0","Standard Case","Gas",0.21918336254132037,197.28284019364361,0,0,0.16438752190599024,147.96213014523275,0,"Mbbl","MMcf","bbl",73.94,4.6829999999999998,0,12.154862074525893,692.9764171992224,0,705.13127927374831,0.65755008762396105,221.94319521784911,0,222.60074530547308,178.28541067761807,86.187351129363449,487.07350711245459,0,50.029064264472439,0,50,50,50,0,118.02870789682129,115.40654145820632,10,"M$",3.4989733059548249,null,"Seg1","2022-10-01","2026-03-31",null,null,3.3605741579364263,4.2694208389549342,0.31211498973305951,"True",0.75,0.75,"1","1",0,1,"ROOSEVELT 3-5-18CH",39,"35-063-24826-0000","35063248260000","008500","269133","00039","23500113865",null,"A61BE2A680924536815200039"]
["ROOSEVELT 4-5-18CH","A61BE2A680924536815800040","default","TxWells","All Cases","Proved","Producing","CARSON","CANEY","HUGHES","OK","CALYX ENERGY III LLC",40,"35063248480000",35.191330000000001,-96.056510000000003,0,"15825","N  8.0/E  12.0/SEC  5.0  SE","0","0","Standard Case","Gas",3.0802247404608822E-3,2497.9203822333516,0,0,2.3101685553456618E-3,1873.4402866750133,0,"Mbbl","MMcf","bbl",85.05,4.7240000000000002,0,0.19647983563214855,8849.698870650458,0,8849.895350486091,9.2406742213826474E-3,2810.1604300125205,0,2810.1696706867406,1059.7688897794269,512.31714963237755,4382.255710098545,0,627.90007511698809,0,50,50,50,0,3789.7395652705573,2402.4500176383281,10,"M$",20.772073921971248,null,"Seg1","2022-10-01","2043-07-09",null,null,76.79479130541111,381.14350518332674,1.09514031485284E-2,"True",0.75,0.75,"1","1",0,1,"ROOSEVELT 4-5-18CH",40,"35-063-24848-0000","35063248480000","008500","269133","00040","23500113866",null,"A61BE2A680924536815800040"]
["SCHRUTE FARMS 1-16-4CH","A61BE2A680924536816100041","default","TxWells","All Cases","Proved","Producing","VERNON NORTHWEST","MISSISSIPPIAN","MCINTOSH","OK","CALYX ENERGY III LLC",41,"35091218110000",35.255229999999997,-95.944869999999995,0,"16201","N  9.0/E  13.0/SEC  16.0  NWSWSWNW","0","0","Standard Case","Gas",5.7274822378070044E-2,19.740495826556412,0,0,4.2956116783552531E-2,14.805371869917309,0,"Mbbl","MMcf","bbl",83.93,5.29,0,3.6053277266299575,78.322222861760736,0,81.927550588390687,0.17182446713421012,22.208057804875963,0,22.379882272010178,25.17741067761807,12.171351129363449,59.728644078991699,0,5.8127597142463179,0,50,50,50,0,-33.613853204847331,-31.588352986061022,10,"M$",0.4982888432580424,null,"Seg1","2022-10-01","2023-03-31",null,null,0.32772293590305335,0.33627327271600549,0,"True",0.75,0.75,"1","1",0,1,"SCHRUTE FARMS 1-16-4CH",41,"35-091-21811-0000","35091218110000","052113","269133","00041","23500113920",null,"A61BE2A680924536816100041"]
["SCHRUTE FARMS 1-17-5CH","A61BE2A680924536816700042","default","TxWells","All Cases","Proved","Producing","VERNON NORTHWEST","MISSISSIPPIAN","MCINTOSH","OK","CALYX ENERGY III LLC",42,"35091218120000",35.255270000000003,-95.944869999999995,0,"16220","N  9.0/E  13.0/SEC  16.0  NWSWSWNW","0","0","Standard Case","Gas",0,882.62496699748635,0,0,0,661.96872524811477,0,"Mbbl","MMcf","bbl",0,4.702,0,0,3112.4539020733882,0,3112.4539020733896,0,992.95308787217255,0,992.95308787217255,786.46441067761828,380.19535112936353,2159.6128496791544,0,220.82860435210694,0,50,50,50,0,682.0124480421282,533.70621277247199,10,"M$",15.41409993155373,null,"Seg1","2022-10-01","2038-02-28",null,null,14.640248960842561,50.529714329559802,4.6543463381245723E-2,"True",0.75,0.75,"1","1",0,1,"SCHRUTE FARMS 1-17-5CH",42,"35-091-21812-0000","35091218120000","052113","269133","00042","23500113921",null,"A61BE2A680924536816700042"]
["SCHRUTE FARMS 1-16-28CH","A61BE2A680924536817000043","default","TxWells","All Cases","Proved","Producing","VERNON NORTHWEST","MISSISSIPPIAN","MCINTOSH","OK","CALYX ENERGY III LLC",43,"35091218100000",35.25515,-95.944869999999995,0,"16600","N  9.0/E  13.0/SEC  16.0  NWSWSWNW","0","0","Standard Case","Gas",3.1525237011953702,2552.1855937245236,0,0,2.3643927758965275,1914.1391952933925,0,"Mbbl","MMcf","bbl",59.926000000000002,4.8940000000000001,0,141.6895771853118,9367.1172971475044,0,9508.806874332824,9.4575711035861083,2871.2087929400891,0,2880.6663640436741,1838.6927261045255,888.86721017420746,5608.226300322407,0,674.6498477339137,0,50,50,50,0,3175.9307262765024,1740.5491601479889,10,"M$",36.038329911019837,null,"Seg1","2022-10-01","2058-10-14",null,null,64.518614525529927,1260.6135166686001,2.7378507871321013E-3,"True",0.75,0.75,"1","1",0,1,"SCHRUTE FARMS 1-16-28CH",43,"35-091-21810-0000","35091218100000","052113","269133","00043","23500113922",null,"A61BE2A680924536817000043"]
["SCHRUTE FARMS 1-17-29CH","A61BE2A680924536817300044","default","TxWells","All Cases","Proved","Producing","VERNON NORTHWEST","MISSISSIPPIAN","MCINTOSH","OK","CALYX ENERGY III LLC",44,"35091218090000",35.255189999999999,-95.944869999999995,0,"16600","N  9.0/E  13.0/SEC  16.0  NWSWSWNW","0","0","Standard Case","Gas",1.1358303530114,521.35829897189535,0,0,0.85187276475855001,391.01872422892149,0,"Mbbl","MMcf","bbl",67.626999999999995,4.5709999999999997,0,57.609609873010101,1787.4858930222722,0,1845.0955028952822,3.4074910590341996,586.52808634338237,0,589.93557740241647,433.46541067761808,209.54735112936342,1232.948339209398,0,130.90952593042027,0,50,50,50,0,431.23763775546405,373.75752557404525,10,"M$",8.4982888432580417,null,"Seg1","2022-10-01","2031-03-31",null,null,9.6247527551092791,18.420001965486318,0.10951403148528401,"True",0.75,0.75,"1","1",0,1,"SCHRUTE FARMS 1-17-29CH",44,"35-091-21809-0000","35091218090000","052113","269133","00044","23500113926",null,"A61BE2A680924536817300044"]
["MAVERICK 1-10-3CH","A61BE2A680924536817700045","default","TxWells","All Cases","Proved","Producing","PAPOOSE","MISSISSIPPIAN","HUGHES","OK","CALYX ENERGY III LLC",45,"35063248230000",35.261589999999998,-96.333950000000002,0,"13617","N  9.0/E  9.0/SEC  11.0  SWSWSWSW","0","0","Standard Case","Gas",0,0,0,0,0,0,0,"Mbbl","MMcf","bbl",0,0,0,0,0,0,0,0,0,0,0,0,0,0,0,0,0,50,50,50,0,-50,-50,10,"M$",0,null,"Seg1","2022-10-01","2022-10-01",null,null,0,0,0,"False",0.75,0.75,"0","0",0,1,"MAVERICK 1-10-3CH",45,"35-063-24823-0000","35063248230000","037776","269133","00045","23500113968",null,"A61BE2A680924536817700045"]
["MAVERICK 1-14-23CH","A61BE2A680924536817900046","default","TxWells","All Cases","Proved","Producing","FUHRMAN","MISSISSIPPIAN","HUGHES","OK","CALYX ENERGY III LLC",46,"35063248200000",35.26155,-96.333950000000002,0,"14150","N  9.0/E  9.0/SEC  11.0  SWSWSWSW","0","0","Standard Case","Gas",0.20212073715195511,204.55383928008882,0,0,0.15159055286396633,153.41537946006662,0,"Mbbl","MMcf","bbl",74.903000000000006,4.6950000000000003,0,11.354581066590832,720.24200879169189,0,731.59658985828287,0.60636221145586544,230.12306919009993,0,230.72943140155587,178.28541067761807,86.187351129363449,495.20219320853738,0,51.906778050445169,0,50,50,50,0,134.48761859930036,131.4710906713251,10,"M$",3.4989733059548249,null,"Seg1","2022-10-01","2026-03-31",null,null,3.6897523719860073,4.7245230480858433,0.26830937713894593,"True",0.75,0.75,"1","1",0,1,"MAVERICK 1-14-23CH",46,"35-063-24820-0000","35063248200000","018298","269133","00046","23500113969",null,"A61BE2A680924536817900046"]
["MAVERICK 1-15-22CH","A61BE2A680924536818100047","default","TxWells","All Cases","Proved","Producing","FUHRMAN","MISSISSIPPIAN","HUGHES","OK","CALYX ENERGY III LLC",47,"35063248220000",35.261510000000001,-96.333950000000002,0,"14180","N  9.0/E  9.0/SEC  11.0  SWSWSWSW","0","0","Standard Case","Gas",2.719945620003756E-2,368.6662839933889,0,0,2.0399592150028172E-2,276.49971299504165,0,"Mbbl","MMcf","bbl",81.031000000000006,4.5759999999999996,0,1.652991106627113,1265.3395858585607,0,1266.9925769651875,8.1598368600112686E-2,414.74956949256256,0,414.83116786116273,281.47524229979467,136.07173716632443,832.37814732728179,0,89.893123335680045,0,50,50,50,0,294.72130630222574,266.41750541611924,10,"M$",5.5195071868583163,null,"Seg1","2022-10-01","2028-04-07",null,null,6.8944261260445145,10.229756001866001,0.17796030116358649,"True",0.75,0.75,"1","1",0,1,"MAVERICK 1-15-22CH",47,"35-063-24822-0000","35063248220000","018298","269133","00047","23500113970",null,"A61BE2A680924536818100047"]
["MAVERICK 1-11-2CH","A61BE2A680924536818300048","default","TxWells","All Cases","Proved","Producing","PAPOOSE","MISSISSIPPIAN","HUGHES","OK","CALYX ENERGY III LLC",48,"35063248210000",35.261629999999997,-96.333939999999998,0,"13610","N  9.0/E  9.0/SEC  11.0  SWSWSWSW","0","0","Standard Case","Gas",2.2013631363084891E-2,31.664307273624949,0,0,1.6510223522313665E-2,23.74823045521871,0,"Mbbl","MMcf","bbl",83.283000000000001,5.13,0,1.3750139397362351,121.83197372873734,0,123.20698766847357,6.6040894089254676E-2,35.622345682828069,0,35.68838657691731,32.387537325296421,15.656895542160694,83.732819444374428,0,8.7415357750781997,0,50,50,50,0,-19.267367550979063,-16.90341480789322,10,"M$",0.64065708418891165,null,"Seg1","2022-10-01","2023-05-22",null,null,0.61465264898041883,0.63975818082898106,0,"True",0.75,0.75,"1","1",0,1,"MAVERICK 1-11-2CH",48,"35-063-24821-0000","35063248210000","037776","269133","00048","23500113971",null,"A61BE2A680924536818300048"]
["OSCAR LU 1-17-20WH","A61BE2A680924536818600049","default","TxWells","All Cases","Proved","Producing","SCIPIO NORTHWEST","WOODFORD","MCINTOSH","OK","CALYX ENERGY III LLC",49,"35091218010000",35.173400000000001,-95.964349999999996,0,"14731","N  8.0/E  13.0/SEC  17.0  NWNWNWNW","0","0","Standard Case","Gas",0.14206367986554225,3514.9873794985774,0,0,0.10654775989915671,2636.2405346239334,0,"Mbbl","MMcf","bbl",74.656999999999996,4.7569999999999997,0,7.9545670487443205,12539.894458284356,0,12547.849025333098,0.42619103959662674,3954.3608019358999,0,3954.7869929754947,1261.5603162217667,609.86786036961018,5826.2151695668717,0,890.26988834738324,0,50,50,50,0,5781.3639674188435,3418.6156794981721,10,"M$",24.725530458590001,null,"Seg1","2022-10-01","2047-06-22",null,null,116.62727934837687,802.91525979355879,5.4757015742642025E-3,"True",0.75,0.75,"1","1",0,1,"OSCAR LU 1-17-20WH",49,"35-091-21801-0000","35091218010000","044414","269133","00049","23500113972",null,"A61BE2A680924536818600049"]
["OSCAR LU 1-18-19WH","A61BE2A680924536820200050","default","TxWells","All Cases","Proved","Producing","SCIPIO NORTHWEST","WOODFORD","MCINTOSH","OK","CALYX ENERGY III LLC",50,"35091218020000",35.173439999999999,-95.964349999999996,0,"14816","N  8.0/E  13.0/SEC  17.0  NWNWNWNW","0","0","Standard Case","Gas",0,5269.9419399194139,0,0,0,3952.45645493956,0,"Mbbl","MMcf","bbl",0,4.8170000000000002,0,0,19038.643384428178,0,19038.643384428178,0,5928.68468240934,0,5928.6846824093363,1645.6366129032269,795.5393548387101,8369.8606501512731,0,1350.7917481251793,0,50,50,50,0,9267.9909861517262,4828.0748648696263,10,"M$",32.246406570841877,null,"Seg1","2022-10-01","2054-12-29",null,null,186.35981972303412,2396.1143830908886,2.7378507871321013E-3,"True",0.75,0.75,"1","1",0,1,"OSCAR LU 1-18-19WH",50,"35-091-21802-0000","35091218020000","044414","269133","00050","23500113973",null,"A61BE2A680924536820200050"]
["CHEATWOOD 1-16-9CH","A61BE2A680924536821400051","default","TxWells","All Cases","Proved","Producing","BEARDEN NORTH","MISSISSIPPIAN","OKFUSKEE","OK","CALYX ENERGY III LLC",51,"35107236010000",35.336509999999997,-96.351929999999996,0,"12830","N  10.0/E  9.0/SEC  15.0  NWNWSWSW","0","0","Standard Case","Gas",0,2719.7520797950688,0,0,0,2039.8140598463024,0,"Mbbl","MMcf","bbl",0,4.9130000000000003,0,0,10021.014025974004,0,10021.014025974006,0,3059.7210897694536,0,3059.7210897694499,1879.363147843944,908.52824640657138,5847.6124840199654,0,710.99094514285559,0,50,50,50,0,3412.410596811184,1713.1113748342059,10,"M$",36.832306639288149,null,"Seg1","2022-10-01","2059-07-31",null,null,69.248211936223655,1342.7626751079501,5.4757015742642025E-3,"True",0.75,0.75,"1","1",0,1,"CHEATWOOD 1-16-9CH",51,"35-107-23601-0000","35107236010000","003137","269133","00051","23500113974",null,"A61BE2A680924536821400051"]
["CHEATWOOD 1-15-27CH","A61BE2A680924536821600052","default","TxWells","All Cases","Proved","Producing","PAPOOSE NORTH","MISSISSIPPIAN","OKFUSKEE","OK","CALYX ENERGY III LLC",52,"35107236040000",35.33643,-96.351929999999996,0,"14935","N  10.0/E  9.0/SEC  15.0  NWNWSWSW","0","0","Standard Case","Gas",0,1520.7196768879301,0,0,0,1140.5397576659479,0,"Mbbl","MMcf","bbl",0,4.782,0,0,5453.6942896297242,0,5453.6942896297251,0,1710.8096364989215,0,1710.8096364989206,1111.9049735709086,537.52095595151377,3360.2355660213429,0,386.93960984922899,0,50,50,50,0,1656.5191137591535,1108.263293160504,10,"M$",21.79329226557152,null,"Seg1","2022-10-01","2044-07-16",null,null,34.130382275183031,195.13477504576431,1.6427104722792598E-2,"True",0.75,0.75,"1","1",0,1,"CHEATWOOD 1-15-27CH",52,"35-107-23604-0000","35107236040000","037779","269133","00052","23500113975",null,"A61BE2A680924536821600052"]
["CHEATWOOD 1-16-28CH","A61BE2A680924536821800053","default","TxWells","All Cases","Proved","Producing","PAPOOSE NORTH","MISSISSIPPIAN","OKFUSKEE","OK","CALYX ENERGY III LLC",53,"35107236020000",35.336469999999998,-96.351929999999996,0,"14871","N  10.0/E  9.0/SEC  15.0  NWNWSWSW","0","0","Standard Case","Gas",1.6019394399685161,743.71384909745711,0,0,1.2014545799763869,557.78538682309295,0,"Mbbl","MMcf","bbl",62.67,4.6719999999999997,0,75.295089045422642,2605.8565607542446,0,2681.1516497996672,4.8058183199055486,836.67808023463931,0,841.48389855454502,714.66851957342533,345.48753262237534,1901.6399507503456,0,190.22770955328636,0,50,50,50,0,539.28398949603525,441.6214304057147,10,"M$",14.01232032854209,null,"Seg1","2022-10-01","2036-10-04",null,null,11.785679789920698,36.644083321310987,6.0232717316906215E-2,"True",0.75,0.75,"1","1",0,1,"CHEATWOOD 1-16-28CH",53,"35-107-23602-0000","35107236020000","037779","269133","00053","23500113976",null,"A61BE2A680924536821800053"]
["OSCAR LU 2-17-20CH","A61BE2A680924536822000054","default","TxWells","All Cases","Proved","Producing","SCIPIO NORTHWEST","CANEY","MCINTOSH","OK","CALYX ENERGY III LLC",54,"35091218030000",35.173479999999998,-95.964349999999996,0,"14540","N  8.0/E  13.0/SEC  17.0  NWNWNWNW","0","0","Standard Case","Gas",1.8968131777926965E-2,23.535600571156987,0,0,1.4226098833445219E-2,17.651700428367739,0,"Mbbl","MMcf","bbl",83.581000000000003,5.1820000000000004,0,1.1890343035730184,91.476375462811518,0,92.665409766384542,5.6904395333780874E-2,26.477550642551606,0,26.534455037885394,29.369279260780289,14.197798767967146,70.101533066632825,0,6.5746108229249822,0,50,50,50,0,-34.010734123173272,-31.611205916053354,10,"M$",0.58042436687200538,null,"Seg1","2022-10-01","2023-04-30",null,null,0.3197853175365345,0.33033792015723079,0,"True",0.75,0.75,"1","1",0,1,"OSCAR LU 2-17-20CH",54,"35-091-21803-0000","35091218030000","044414","269133","00054","23500113981",null,"A61BE2A680924536822000054"]
["SCRANTON 2-19-31MH","A61BE2A680924536822300055","default","TxWells","All Cases","Proved","Producing","WELEETKA DISTRICT EAST","MISSISSIPPIAN","OKFUSKEE","OK","CALYX ENERGY III LLC",55,"35107236100000",35.331380000000003,-96.086500000000001,0,"13295","N  10.0/E  12.0/SEC  19.0  NWSWNWNW","0","0","Standard Case","Gas",1.38036271295558,684.06568522636906,0,0,1.0352720347166851,513.04926391977676,0,"Mbbl","MMcf","bbl",65.073999999999998,4.6150000000000002,0,67.368947781156777,2367.5356624361639,0,2434.9046102173206,4.1410881388667402,769.57389587966509,0,773.71498401853205,588.25015811088292,284.37393018480492,1646.3390723142199,0,172.75648209491891,0,50,50,50,0,565.80905580818194,472.80562573022178,10,"M$",11.53182751540041,null,"Seg1","2022-10-01","2034-04-12",null,null,12.316181116163637,30.808484282618867,6.8446269678302529E-2,"True",0.75,0.75,"1","1",0,1,"SCRANTON 2-19-31MH",55,"35-107-23610-0000","35107236100000","056474","269133","00055","23500114048",null,"A61BE2A680924536822300055"]
["SCRANTON 1-19-31WH","A61BE2A680924536822600056","default","TxWells","All Cases","Proved","Producing","GREGORY","MISSISSIPPIAN","OKFUSKEE","OK","CALYX ENERGY III LLC",56,"35107236090000",35.331420000000001,-96.086500000000001,0,"15345","N  10.0/E  12.0/SEC  19.0  NW","0","0","Standard Case","Gas",0.12673218122122989,2536.2444967164438,0,0,9.5049135915922414E-2,1902.1833725373328,0,"Mbbl","MMcf","bbl",76.994,5.7290000000000001,0,7.3182241793157203,10897.483742100781,0,10904.801966280096,0.3801965436636896,2853.2750588059985,0,2853.6552553496622,1887.8080164271062,912.61069404517514,5654.0739658219436,0,773.69569950757284,0,50,50,50,0,4427.032300950581,2285.2823509164436,10,"M$",36.999315537303211,null,"Seg1","2022-10-01","2059-09-30",null,null,89.540646019011646,1820.923040749602,2.7378507871321013E-3,"True",0.75,0.75,"1","1",0,1,"SCRANTON 1-19-31WH",56,"35-107-23609-0000","35107236090000","020597","269133","00056","23500114050",null,"A61BE2A680924536822600056"]
["SCRANTON 1-19-7CH","A61BE2A680924536822900057","default","TxWells","All Cases","Proved","Producing","WELEETKA DISTRICT EAST","MISSISSIPPIAN","OKFUSKEE","OK","CALYX ENERGY III LLC",57,"35107236080000",35.33146,-96.086500000000001,0,"14255","N  10.0/E  12.0/SEC  19.0  NW","0","0","Standard Case","Gas",1.9011006933774371E-2,207.07487524493769,0,0,1.4258255200330779E-2,155.30615643370325,0,"Mbbl","MMcf","bbl",82.209000000000003,4.6870000000000003,0,1.1721557431213492,727.85657312446017,0,729.02872886758144,5.7033020801323109E-2,232.95923465055489,0,233.01626767135622,178.28541067761807,86.187351129363449,497.48902947833773,0,51.724588313154904,0,50,50,50,0,129.8151110760889,126.25500164052633,10,"M$",3.4989733059548249,null,"Seg1","2022-10-01","2026-03-31",null,null,3.5963022215217753,4.5767533466490002,0.29021218343600269,"True",0.75,0.75,"1","1",0,1,"SCRANTON 1-19-7CH",57,"35-107-23608-0000","35107236080000","056474","269133","00057","23500114058",null,"A61BE2A680924536822900057"]
["DUNDER 1-18-6CH","A61BE2A680924536823200058","default","TxWells","All Cases","Proved","Producing","VERNON NORTHWEST","MISSISSIPPIAN","MCINTOSH","OK","CALYX ENERGY III LLC",58,"35091218130000",35.25562,-95.974429999999998,0,"14710","N  9.0/E  13.0/SEC  18.0  SWNESENW","0","0","Standard Case","Gas",7.6748330449756749E-2,144.13773743819897,0,0,5.7561247837317552E-2,108.10330307864923,0,"Mbbl","MMcf","bbl",78.852000000000004,4.7880000000000003,0,4.5388012213633404,517.64821736056854,0,522.18701858193197,0.23024499134927023,162.15495461797383,0,162.38519960932314,127.38913963039015,61.582899383983573,351.35723862369684,0,37.049168968388067,0,50,50,50,0,83.780610989847048,83.91483650428161,10,"M$",2.5023956194387398,null,"Seg1","2022-10-01","2025-04-01",null,null,2.6756122197969403,3.1526710741088917,0.3559206023271731,"True",0.75,0.75,"1","1",0,1,"DUNDER 1-18-6CH",58,"35-091-21813-0000","35091218130000","052113","269133","00058","23500114068",null,"A61BE2A680924536823200058"]
["DUNDER 1-18-30CH","A61BE2A680924536823500059","default","TxWells","All Cases","Proved","Producing","VERNON NORTHWEST","MISSISSIPPIAN","MCINTOSH","OK","CALYX ENERGY III LLC",59,"35091218140000",35.255540000000003,-95.974429999999998,0,"15135","N  9.0/E  13.0/SEC  18.0  SWNESENW","0","0","Standard Case","Gas",0.10351962301244129,203.44480249123379,0,0,7.763971725933097E-2,152.58360186842535,0,"Mbbl","MMcf","bbl",78.444000000000003,4.6900000000000004,0,6.0903560667842438,715.65385826375871,0,721.74421433054306,0.31055886903732388,228.87540280263801,0,229.18596167167533,178.28541067761807,86.187351129363449,493.65872347865684,0,51.207752006752031,0,50,50,50,0,126.87773884513416,124.45040584945616,10,"M$",3.4989733059548249,null,"Seg1","2022-10-01","2026-03-31",null,null,3.5375547769026827,4.5256298746978745,0.28199863107460638,"True",0.75,0.75,"1","1",0,1,"DUNDER 1-18-30CH",59,"35-091-21814-0000","35091218140000","052113","269133","00059","23500114110",null,"A61BE2A680924536823500059"]
["TWAIN 1-9-4WH","A61BE2A680924536823900060","default","TxWells","All Cases","Proved","Producing","SCIPIO NORTHWEST","WOODFORD","MCINTOSH","OK","CALYX ENERGY III LLC",60,"35091218050000",35.175139999999999,-95.930970000000002,0,"14183","N  8.0/E  13.0/SEC  9.0  NESESESE","0","0","Standard Case","Gas",0,0,0,0,0,0,0,"Mbbl","MMcf","bbl",0,0,0,0,0,0,0,0,0,0,0,0,0,0,0,0,0,50,50,50,0,-50,-50,10,"M$",0,null,"Seg1","2022-10-01","2022-10-01",null,null,0,0,0,"False",0.75,0.75,"0","0",0,1,"TWAIN 1-9-4WH",60,"35-091-21805-0000","35091218050000","044414","269133","00060","23500114151",null,"A61BE2A680924536823900060"]
["TWAIN 2-9-4CH","A61BE2A680924536824100061","default","TxWells","All Cases","Proved","Producing","SCIPIO NORTHWEST","CANEY","MCINTOSH","OK","CALYX ENERGY III LLC",61,"35091218230000",35.175179999999997,-95.930970000000002,0,"13912","N  8.0/E  13.0/SEC  9.0  NESESESE","0","0","Standard Case","Gas",0.37827132602259933,799.91373533817728,0,0,0.28370349451694959,599.93530150363301,0,"Mbbl","MMcf","bbl",65.777000000000001,4.6020000000000003,0,18.661159011001264,2761.1183562238029,0,2779.779515234804,1.1348139780677982,899.90295225544958,0,901.03776623351723,535.53741067761814,258.89135112936344,1695.4665280404988,0,197.22535660590933,0,50,50,50,0,837.08763058839565,698.36190859189628,10,"M$",10.4996577686516,null,"Seg1","2022-10-01","2033-03-31",null,null,17.741752611767911,40.728025847112896,4.9281314168377818E-2,"True",0.75,0.75,"1","1",0,1,"TWAIN 2-9-4CH",61,"35-091-21823-0000","35091218230000","044414","269133","00061","23500114152",null,"A61BE2A680924536824100061"]
["TWAIN 1-10-3WH","A61BE2A680924536824300062","default","TxWells","All Cases","Proved","Producing","SCIPIO NORTHWEST","WOODFORD","MCINTOSH","OK","CALYX ENERGY III LLC",62,"35091218040000",35.175060000000002,-95.930970000000002,0,"13817","N  8.0/E  13.0/SEC  9.0  SESESESE","0","0","Standard Case","Gas",1.2629689055143513E-2,18.765066375299,0,0,9.472266791357634E-3,14.073799781474248,0,"Mbbl","MMcf","bbl",84.096000000000004,5.2859999999999996,0,0.79658104802479901,74.398888545518631,0,75.195469593543436,3.7889067165430529E-2,21.110699672211375,0,21.148588739376805,23.256701000198717,11.242835000331191,55.648124739906713,0,5.3351185676619055,0,50,50,50,0,-35.787773714025192,-33.82653911549842,10,"M$",0.45995893223819301,null,"Seg1","2022-10-01","2023-03-17",null,null,0.28424452571949604,0.29195291193125816,0,"True",0.75,0.75,"1","1",0,1,"TWAIN 1-10-3WH",62,"35-091-21804-0000","35091218040000","044414","269133","00062","23500114153",null,"A61BE2A680924536824300062"]
["MOSE 1-6-7WH","A61BE2A680924536824500063","default","TxWells","All Cases","Proved","Producing","SCIPIO NORTHWEST","WOODFORD / MAYES","MCINTOSH","OK","CALYX ENERGY III LLC",63,"35091218150000",35.20485,-95.964280000000002,0,"14546","N  9.0/E  13.0/SEC  31.0  SENESESE","0","0","Standard Case","Gas",0,278.53665049542616,0,0,0,208.9024878715696,0,"Mbbl","MMcf","bbl",0,4.6269999999999998,0,0,966.64267295956529,0,966.64267295956529,0,313.35373180735439,0,313.35373180735439,229.32141067761808,110.85935112936345,653.53449361433593,0,68.583297646481157,0,50,50,50,0,194.5248816987482,184.3341863627125,10,"M$",4.4982888432580417,null,"Seg1","2022-10-01","2027-03-31",null,null,4.8904976339749631,6.768543543311961,0.21902806297056809,"True",0.75,0.75,"1","1",0,1,"MOSE 1-6-7WH",63,"35-091-21815-0000","35091218150000","044414","269133","00063","23500114191",null,"A61BE2A680924536824500063"]
["MOSE 1-5-8WH","A61BE2A680924536824800064","default","TxWells","All Cases","Proved","Producing","SCIPIO NORTHWEST","WOODFORD / MAYES","MCINTOSH","OK","CALYX ENERGY III LLC",64,"35091218170000",35.204830000000001,-95.964309999999998,0,"15155","N  9.0/E  13.0/SEC  31.0  SENESESE","0","0","Standard Case","Gas",7.6002427995141807E-3,2451.8179817292944,0,0,5.7001820996356355E-3,1838.8634862969711,0,"Mbbl","MMcf","bbl",84.488,4.875,0,0.48159482750118687,8964.7159017579688,0,8965.1974965854679,2.2800728398542545E-2,2758.2952294454572,0,2758.318030173853,1706.6240751142623,825.02212519043564,5289.9642304785511,0,636.08076238273895,0,50,50,50,0,2989.1525037241786,1712.2444171563398,10,"M$",33.442847364818611,null,"Seg1","2022-10-01","2056-03-10",null,null,60.783050074483555,957.89322022840588,5.4757015742642025E-3,"True",0.75,0.75,"1","1",0,1,"MOSE 1-5-8WH",64,"35-091-21817-0000","35091218170000","044414","269133","00064","23500114192",null,"A61BE2A680924536824800064"]
["MIFFLIN 1-14-26CH","A61BE2A680924536825100065","default","TxWells","All Cases","Proved","Producing","HANNA NORTHWEST","MISSISSIPPIAN","MCINTOSH","OK","CALYX ENERGY III LLC",65,"35091218190000",35.255859999999998,-95.909499999999994,0,"16042","N  9.0/E  13.0/SEC  14.0  SWNWSWNW","0","0","Standard Case","Gas",0.14319555655773761,1071.0316231347349,0,0,0.10739666741830323,803.27371735105135,0,"Mbbl","MMcf","bbl",75.271000000000001,4.726,0,8.0838403511164056,3796.328536822969,0,3804.4123771740865,0.42958666967321291,1204.9105760265768,0,1205.3401626962502,865.27154004106796,418.29256673511304,2488.9042694724312,0,269.9230581605014,0,50,50,50,0,995.58504954115369,752.39585270321027,10,"M$",16.963723477070491,null,"Seg1","2022-10-01","2039-09-17",null,null,20.911700990823082,82.476129107470072,3.0116358658453107E-2,"True",0.75,0.75,"1","1",0,1,"MIFFLIN 1-14-26CH",65,"35-091-21819-0000","35091218190000","058583","269133","00065","23500114240",null,"A61BE2A680924536825100065"]
["MIFFLIN 1-15-27CH","A61BE2A680924536825300066","default","TxWells","All Cases","Proved","Producing","HANNA NORTHWEST","MISSISSIPPIAN","MCINTOSH","OK","CALYX ENERGY III LLC",66,"35091218210000",35.25582,-95.909499999999994,0,"16104","N  9.0/E  13.0/SEC  14.0  SWNWSWNW","0","0","Standard Case","Gas",0.11908688188128169,377.3336652796321,0,0,8.9315161410961255E-2,283.0002489597241,0,"Mbbl","MMcf","bbl",76.31,4.59,0,6.8156195885025292,1299.0328535642927,0,1305.8484731527956,0.35726064564384497,424.5003734395861,0,424.85763408523002,280.49713963039017,135.59889938398356,840.95367309960375,0,92.649949170190823,0,50,50,50,0,322.24485088300088,293.45330787731513,10,"M$",5.500342231348391,null,"Seg1","2022-10-01","2028-03-31",null,null,7.4448970176600184,11.146998529462905,0.1533196440793976,"True",0.75,0.75,"1","1",0,1,"MIFFLIN 1-15-27CH",66,"35-091-21821-0000","35091218210000","058583","269133","00066","23500114241",null,"A61BE2A680924536825300066"]
["MIFFLIN 1-15-3CH","A61BE2A680924536825700067","default","TxWells","All Cases","Proved","Producing","HANNA NORTHWEST","MISSISSIPPIAN","MCINTOSH","OK","CALYX ENERGY III LLC",67,"35091218220000",35.25591,-95.909499999999994,0,"15732","N  9.0/E  13.0/SEC  14.0  SWNWSWNW","0","0","Standard Case","Gas",0,327.7421142523865,0,0,0,245.8065856892899,0,"Mbbl","MMcf","bbl",0,4.6580000000000004,0,0,1144.9691982912525,0,1144.9691982912525,0,368.7098785339349,0,368.70987853393478,229.32141067761808,110.85935112936345,708.89064034091632,0,81.235564618764371,0,50,50,50,0,304.84299333157185,285.67940032687324,10,"M$",4.4982888432580417,null,"Seg1","2022-10-01","2027-03-31",null,null,7.0968598666314398,9.9400349047037597,0.14236824093086919,"True",0.75,0.75,"1","1",0,1,"MIFFLIN 1-15-3CH",67,"35-091-21822-0000","35091218220000","058583","269133","00067","23500114242",null,"A61BE2A680924536825700067"]
["EDISON 2-18-19WH","A61BE2A680924536826100068","default","TxWells","All Cases","Proved","Producing","SCIPIO NORTHWEST","WOODFORD","MCINTOSH","OK","CALYX ENERGY III LLC",68,"35091218240000",35.176099999999998,-95.976640000000003,0,"15200","N  8.0/E  13.0/SEC  7.0  SW","0","0","Standard Case","Gas",0,1723.0255307963987,0,0,0,1292.2691480972985,0,"Mbbl","MMcf","bbl",0,4.8,0,0,6203.2051934811097,0,6203.2051934811097,0,1938.4037221459478,0,1938.4037221459466,1211.083232032855,585.46605338809059,3734.9530075668922,0,440.11740847748484,0,50,50,50,0,1978.1347774367327,1328.8853901203995,10,"M$",23.737166324435311,null,"Seg1","2022-10-01","2046-06-26",null,null,40.562695548734638,283.50066759496792,1.09514031485284E-2,"True",0.75,0.75,"1","1",0,1,"EDISON 2-18-19WH",68,"35-091-21824-0000","35091218240000","044414","269133","00068","23500114344",null,"A61BE2A680924536826100068"]
["EDISON 3-18-19WH","A61BE2A680924536826500069","default","TxWells","All Cases","Proved","Producing","SCIPIO NORTHWEST","WOODFORD","MCINTOSH","OK","CALYX ENERGY III LLC",69,"35091218250000",35.176099999999998,-95.976690000000005,0,"15749","N  8.0/E  13.0/SEC  7.0  SW","0","0","Standard Case","Gas",0.30814959361683908,2148.4105760116013,0,0,0.2311121952126293,1611.3079320087011,0,"Mbbl","MMcf","bbl",66.432000000000002,4.6230000000000002,0,15.353310636654626,7449.8197115742514,0,7465.1730222109063,0.92444878085051718,2416.9618980130517,0,2417.8863467939018,703.34258647413401,340.0123107902233,3461.2412440582593,0,529.65402592586372,0,50,50,50,0,3424.2777522267834,2591.3551456979039,10,"M$",13.787816563997261,null,"Seg1","2022-10-01","2036-07-14",null,null,69.485555044535644,205.52884871026635,1.3689253935660501E-2,"True",0.75,0.75,"1","1",0,1,"EDISON 3-18-19WH",69,"35-091-21825-0000","35091218250000","044414","269133","00069","23500114345",null,"A61BE2A680924536826500069"]
["EDISON 4-18-19WH","A61BE2A680924536826800070","default","TxWells","All Cases","Proved","Producing","SCIPIO NORTHWEST","WOODFORD / MAYES","MCINTOSH","OK","CALYX ENERGY III LLC",70,"35091218260000",35.176099999999998,-95.976740000000007,0,"0","N  8.0/E  13.0/SEC  7.0  SW","0","0","Standard Case","Gas",0.46631665193935784,938.77031156419207,0,0,0.34973748895451845,704.07773367314394,0,"Mbbl","MMcf","bbl",67.382999999999996,4.6269999999999998,0,23.566527733313198,3257.8944352050225,0,3281.4609629383353,1.3989499558180736,1056.1166005097159,0,1057.515550465534,590.76527926078029,285.58979876796712,1933.8706284942814,0,232.81965532047494,0,50,50,50,0,1064.7706791235794,881.15614067072329,10,"M$",11.58110882956878,null,"Seg1","2022-10-01","2034-04-30",null,null,22.295413582471564,56.826644086038961,3.285420944558521E-2,"True",0.75,0.75,"1","1",0,1,"EDISON 4-18-19WH",70,"35-091-21826-0000","35091218260000","044414","269133","00070","23500114346",null,"A61BE2A680924536826800070"]
["TIMBERWOLF 1-19-18CH","A61BE2A680924536827000071","default","TxWells","All Cases","Proved","Producing","OKEMAH","MISSISSIPPIAN","OKFUSKEE","OK","CALYX ENERGY III LLC",71,"35107235980000",35.31953,-96.301090000000002,0,"14100","N  10.0/E  9.0/SEC  24.0  SWSESESE","0","0","Standard Case","Gas",2.02150160124933E-2,1479.2800392421882,0,0,1.5161262009369977E-2,1109.4600294316415,0,"Mbbl","MMcf","bbl",82.751000000000005,4.7610000000000001,0,1.2546132270852886,5281.9509907701286,0,5283.2056039972158,6.0645048037479908E-2,1664.1900441474625,0,1664.2506891954999,1036.7716451612907,501.1997419354841,3202.2220762922748,0,374.8434376036023,0,50,50,50,0,1656.1400901013387,1164.4373543737827,10,"M$",20.31759069130732,null,"Seg1","2022-10-01","2043-01-24",null,null,34.12280180202675,177.09749340782071,1.6427104722792598E-2,"True",0.75,0.75,"1","1",0,1,"TIMBERWOLF 1-19-18CH",71,"35-107-23598-0000","35107235980000","036718","269133","00071","23500114347",null,"A61BE2A680924536827000071"]
["TIMBERWOLF 1-24-13CH","A61BE2A680924536827300072","default","TxWells","All Cases","Proved","Producing","OKEMAH","MISSISSIPPIAN","OKFUSKEE","OK","CALYX ENERGY III LLC",72,"35107235970000",35.319609999999997,-96.301090000000002,0,"13897","N  10.0/E  9.0/SEC  24.0  SWSESESE","0","0","Standard Case","Gas",1.0535405081343741,728.96769430582981,0,0,0.79015538110078054,546.72577072937224,0,"Mbbl","MMcf","bbl",71.397000000000006,4.6070000000000002,0,56.414496619367497,2518.8223201291798,0,2575.236816748547,3.1606215244031226,820.08865609405848,0,823.24927761846129,382.42941067761808,184.87535112936342,1390.5540394254429,0,182.7130521483094,0,50,50,50,0,951.96972517479469,828.15252141872952,10,"M$",7.4989733059548254,null,"Seg1","2022-10-01","2030-03-31",null,null,20.039394503495888,35.942075170554496,4.9281314168377818E-2,"True",0.75,0.75,"1","1",0,1,"TIMBERWOLF 1-24-13CH",72,"35-107-23597-0000","35107235970000","036718","269133","00072","23500114348",null,"A61BE2A680924536827300072"]
["EISENHOWER 3-26-25WH","A61BE2A680924536827500073","default","TxWells","All Cases","Proved","Producing","CARSON","WOODFORD","HUGHES","OK","CALYX ENERGY III LLC",73,"35063249010000",35.201720000000002,-96.094920000000002,0,"15512","N  8.0/E  11.0/SEC  1.0  NE","0","0","Standard Case","Gas",0,973.89221661558838,0,0,0,730.41916246169103,0,"Mbbl","MMcf","bbl",0,4.74,0,0,3462.3399482276282,0,3462.3399482276282,0,1095.6287436925368,0,1095.6287436925368,231.83653182751542,112.07521971252567,1439.540495232578,0,245.65301932675021,0,50,50,50,0,1727.1464336682998,1564.6565846075509,10,"M$",4.5475701574264198,null,"Seg1","2022-10-01","2027-04-18",null,null,35.542928673365999,50.205167298471913,2.7378507871321012E-2,"True",0.75,0.75,"1","1",0,1,"EISENHOWER 3-26-25WH",73,"35-063-24901-0000","35063249010000","008500","269133","00073","23500114368",null,"A61BE2A680924536827500073"]
["EISENHOWER 4-36-25WH","A61BE2A680924536827800074","default","TxWells","All Cases","Proved","Producing","CARSON","WOODFORD","HUGHES","OK","CALYX ENERGY III LLC",74,"35063249020000",35.201720000000002,-96.09487,0,"15417","N  8.0/E  11.0/SEC  1.0  SWNENWNE","0","0","Standard Case","Gas",6.5945975596799142E-2,2894.5204023975739,0,0,4.945948169759936E-2,2170.8903017981806,0,"Mbbl","MMcf","bbl",78.084999999999994,4.6180000000000003,0,3.8620436787966197,10025.918264281487,0,10029.780307960282,0.19783792679039747,3256.3354526972716,0,3256.5332906240615,641.24236344969199,309.99160574948667,4207.7672598232402,0,711.61291284978188,0,50,50,50,0,5060.400135287261,3991.5917926435518,10,"M$",12.56947296372347,null,"Seg1","2022-10-01","2035-04-26",null,null,102.20800270574505,280.04935090522156,8.2135523613963042E-3,"True",0.75,0.75,"1","1",0,1,"EISENHOWER 4-36-25WH",74,"35-063-24902-0000","35063249020000","008500","269133","00074","23500114369",null,"A61BE2A680924536827800074"]
["EISENHOWER 5-36-25WH","A61BE2A680924536828200075","default","TxWells","All Cases","Proved","Producing","CARSON","WOODFORD","HUGHES","OK","CALYX ENERGY III LLC",75,"35063249030000",35.201720000000002,-96.094819999999999,0,"15716","N  8.0/E  11.0/SEC  1.0  NE","0","0","Standard Case","Gas",2.7584125941262885E-2,4604.2073916426352,0,0,2.0688094455947166E-2,3453.1555437319766,0,"Mbbl","MMcf","bbl",82.641999999999996,4.6660000000000004,0,1.709715736422095,16112.768908890239,0,16114.478624626658,8.2752377823788664E-2,5179.733315597965,0,5179.8160679757902,987.67410266940499,477.46483778234108,6644.9550084275361,0,1143.3222584172615,0,50,50,50,0,8276.2013577818598,5681.0168672649379,10,"M$",19.356605065023949,null,"Seg1","2022-10-01","2042-02-07",null,null,166.52402715563716,781.7302102530175,5.4757015742642025E-3,"True",0.75,0.75,"1","1",0,1,"EISENHOWER 5-36-25WH",75,"35-063-24903-0000","35063249030000","008500","269133","00075","23500114370",null,"A61BE2A680924536828200075"]
["HAMILTON 4-14-2WH","A61BE2A680924536829500076","default","TxWells","All Cases","Proved","Producing","CARSON","SYLVAN","HUGHES","OK","CALYX ENERGY III LLC",76,"35063249050000",35.16178,-96.012479999999996,0,"0","N  8.0/E  12.0/SEC  14.0  SENWSESW","0","0","Standard Case","Gas",2.5313511246598885,931.63019262460648,0,0,1.8985133434949166,698.72264446845486,0,"Mbbl","MMcf","bbl",67.813000000000002,4.6820000000000004,0,128.74340960816826,3271.7132133790342,0,3400.4566229872034,7.5940533739796665,1048.0839667026826,0,1055.6780200766621,737.48631390342462,356.51818983904093,2149.6825238191277,0,241.26239740094209,0,50,50,50,0,959.51170176713345,772.09448510851075,10,"M$",14.455852156057491,null,"Seg1","2022-10-01","2037-03-15",null,null,20.190234035342669,66.13138094769235,3.0116358658453107E-2,"True",0.75,0.75,"1","1",0,1,"HAMILTON 4-14-2WH",76,"35-063-24905-0000","35063249050000","008500","269133","00076","23500114388",null,"A61BE2A680924536829500076"]
["HAMILTON 3-14-2WH","A61BE2A680924536829800077","default","TxWells","All Cases","Proved","Producing","CARSON","WOODFORD / MAYES","HUGHES","OK","CALYX ENERGY III LLC",77,"35063249060000",35.161769999999997,-96.012429999999995,0,"15538","N  8.0/E  12.0/SEC  14.0  SW","0","0","Standard Case","Gas",2.3694057556700721E-2,1174.1618189720728,0,0,1.7770543167525538E-2,880.62136422905462,0,"Mbbl","MMcf","bbl",82.867000000000004,4.726,0,1.4725900946541746,4162.156220476546,0,4163.6288105711992,7.1082172670102167E-2,1320.9320463435822,0,1321.0031285162511,874.79930800821398,422.89851334702274,2618.7009498714879,0,295.40946411002665,0,50,50,50,0,1199.5183965896847,912.93655061694164,10,"M$",17.141683778234079,null,"Seg1","2022-10-01","2039-11-21",null,null,24.990367931793685,101.6285656059656,2.190280629705681E-2,"True",0.75,0.75,"1","1",0,1,"HAMILTON 3-14-2WH",77,"35-063-24906-0000","35063249060000","008500","269133","00077","23500114389",null,"A61BE2A680924536829800077"]
["HAMILTON 2-14-2WH","A61BE2A680924536830000078","default","TxWells","All Cases","Proved","Producing","CARSON","WOODFORD","HUGHES","OK","CALYX ENERGY III LLC",78,"35063249040000",35.161749999999998,-96.012379999999993,0,"15251","N  8.0/E  12.0/SEC  14.0  SENWSESW","0","0","Standard Case","Gas",2.9292412455377728E-3,470.49245026369744,0,0,2.1969309341533295E-3,352.86933769777312,0,"Mbbl","MMcf","bbl",85.05,4.8099999999999996,0,0.18684897594974065,1697.4041958570165,0,1697.591044832966,8.787723736613318E-3,529.30400654665971,0,529.31279427039613,174.03241067761809,84.131351129363452,787.47655607737772,0,120.44408463089894,0,50,50,50,0,739.67040412468918,695.46718662711953,10,"M$",3.4140999315537299,null,"Seg1","2022-10-01","2026-02-28",null,null,15.793408082493785,20.536479864044821,4.9281314168377818E-2,"True",0.75,0.75,"1","1",0,1,"HAMILTON 2-14-2WH",78,"35-063-24904-0000","35063249040000","008500","269133","00078","23500114390",null,"A61BE2A680924536830000078"]
["TRUMAN 3-24-13WH","A61BE2A680924536830300079","default","TxWells","All Cases","Proved","Producing","DUSTIN","WOODFORD","HUGHES","OK","CALYX ENERGY III LLC",79,"35063249080000",35.230919999999998,-96.083039999999997,0,"15157","N  9.0/E  12.0/SEC  30.0  SENENWNW","0","0","Standard Case","Gas",2.9435807906829257E-3,2213.5766907306815,0,0,2.2076855930121941E-3,1660.1825180480109,0,"Mbbl","MMcf","bbl",85.05,4.83,0,0.18776365968568712,8019.2795575116288,0,8019.4673211713161,8.8307423720487763E-3,2490.2737770720155,0,2490.2826078143871,1443.9620967741946,698.04516129032299,4632.2898658789045,0,568.98120643710467,0,50,50,50,0,2768.1962488553072,1762.8613166160453,10,"M$",28.29568788501026,null,"Seg1","2022-10-01","2051-01-16",null,null,56.363924977106123,591.070411405242,5.4757015742642025E-3,"True",0.75,0.75,"1","1",0,1,"TRUMAN 3-24-13WH",79,"35-063-24908-0000","35063249080000","014390","269133","00079","23500114400",null,"A61BE2A680924536830300079"]
["TRUMAN 5-19-18WH","A61BE2A680924536830600080","default","TxWells","All Cases","Proved","Producing","DUSTIN","WOODFORD","HUGHES","OK","CALYX ENERGY III LLC",80,"35063249090000",35.230919999999998,-96.082939999999994,0,"15019","N  9.0/E  12.0/SEC  30.0  SWNWNENW","0","0","Standard Case","Gas",0.25331482968757651,1026.7072624582363,0,0,0.18998612226568243,770.03044684367694,0,"Mbbl","MMcf","bbl",77.89,4.6230000000000002,0,14.798055542341555,3559.6283489966222,0,3574.4264045389637,0.7599444890627296,1155.0456702655156,0,1155.8056147545781,535.53741067761814,258.89135112936344,1950.2343765615597,0,253.6055534020395,0,50,50,50,0,1320.5864745753643,1109.0974251709351,10,"M$",10.4996577686516,null,"Seg1","2022-10-01","2033-03-31",null,null,27.411729491507284,64.093720651230512,2.7378507871321012E-2,"True",0.75,0.75,"1","1",0,1,"TRUMAN 5-19-18WH",80,"35-063-24909-0000","35063249090000","014390","269133","00080","23500114401",null,"A61BE2A680924536830600080"]
["TRUMAN 6-18-19WH","A61BE2A680924536830700081","default","TxWells","All Cases","Proved","Producing","DUSTIN","WOODFORD","HUGHES","OK","CALYX ENERGY III LLC",81,"35063249100000",35.230919999999998,-96.082989999999995,0,"15015","N  9.0/E  12.0/SEC  30.0  SWNWNENW","0","0","Standard Case","Gas",2.344214074800409,711.5925587736624,0,0,1.7581605561003069,533.69441908024692,0,"Mbbl","MMcf","bbl",67.483999999999995,4.6109999999999998,0,118.64847085502457,2460.8429492875093,0,2579.4914201425345,7.0326422244012283,800.54162862037026,0,807.5742708447716,433.46541067761808,209.54735112936342,1450.5870326517531,0,183.01491625911279,0,50,50,50,0,895.88947123166838,772.03988063521012,10,"M$",8.4982888432580417,null,"Seg1","2022-10-01","2031-03-31",null,null,18.917789424633366,36.983051357810872,4.6543463381245723E-2,"True",0.75,0.75,"1","1",0,1,"TRUMAN 6-18-19WH",81,"35-063-24910-0000","35063249100000","014390","269133","00081","23500114418",null,"A61BE2A680924536830700081"]
["TESLA 5-17-20WH","A61BE2A680924536831000082","default","TxWells","All Cases","Proved","Producing","SCIPIO NORTHWEST","WOODFORD","MCINTOSH","OK","CALYX ENERGY III LLC",82,"35091218270000",35.176409999999997,-95.955619999999996,0,"15715","N  8.0/E  13.0/SEC  8.0  SWNWSWSE","0","0","Standard Case","Gas",2.755322043605562E-3,907.79431411727387,0,0,2.0664915327041717E-3,680.84573558795557,0,"Mbbl","MMcf","bbl",85.05,4.6710000000000003,0,0.17575510485648976,3180.5019697308485,0,3180.6777248357048,8.2659661308166869E-3,1021.2686033819334,0,1021.2768693480641,707.18400582897277,341.86934304828782,2070.3302182253246,0,225.66908457709329,0,50,50,50,0,834.67842203328712,686.96598259866425,10,"M$",13.86447638603696,null,"Seg1","2022-10-01","2036-08-11",null,null,17.693568440665732,55.63593338970653,3.5592060232717312E-2,"True",0.75,0.75,"1","1",0,1,"TESLA 5-17-20WH",82,"35-091-21827-0000","35091218270000","044414","269133","00082","23500114419",null,"A61BE2A680924536831000082"]
["TESLA 4-17-20WH","A61BE2A680924536831200083","default","TxWells","All Cases","Proved","Producing","SCIPIO NORTHWEST","WOODFORD","MCINTOSH","OK","CALYX ENERGY III LLC",83,"35091218280000",35.176369999999999,-95.955640000000002,0,"15445","N  8.0/E  13.0/SEC  8.0  SWNWSWSE","0","0","Standard Case","Gas",0.12194729860950272,1074.3319381101414,0,0,9.1460473957127059E-2,805.74895358260596,0,"Mbbl","MMcf","bbl",76.106999999999999,4.7060000000000004,0,6.9608230034132932,3791.5389067451729,0,3798.4997297485857,0.36584189582850818,1208.6234303739093,0,1208.9892722697368,804.31450268265235,388.8245044710871,2402.1282794234762,0,269.50355582566215,0,50,50,50,0,1076.8678944994472,846.68066740266215,10,"M$",15.76728268309377,null,"Seg1","2022-10-01","2038-07-07",null,null,22.537357889988936,82.387588862158069,2.4640657084188909E-2,"True",0.75,0.75,"1","1",0,1,"TESLA 4-17-20WH",83,"35-091-21828-0000","35091218280000","044414","269133","00083","23500114420",null,"A61BE2A680924536831200083"]
["TESLA 3-17-20WH","A61BE2A680924536831300084","default","TxWells","All Cases","Proved","Producing","SCIPIO NORTHWEST","WOODFORD","MCINTOSH","OK","CALYX ENERGY III LLC",84,"35091218290000",35.176369999999999,-95.955690000000004,0,"15632","N  8.0/E  13.0/SEC  8.0  SWNWSWSE","0","0","Standard Case","Gas",7.4400434665368017E-3,1498.7807597679512,0,0,5.5800325999026011E-3,1124.0855698259634,0,"Mbbl","MMcf","bbl",84.503,4.7670000000000003,0,0.47153018327289425,5358.7751565586705,0,5359.2466867419425,2.2320130399610401E-2,1686.1283547389455,0,1686.1506748693441,1048.8317186858321,507.02986447638625,3242.0122580315624,0,380.23855242434087,0,50,50,50,0,1686.995876286039,1206.961804356456,10,"M$",20.555783709787811,null,"Seg1","2022-10-01","2043-04-21",null,null,34.73991752572077,187.90989727183668,1.3689253935660501E-2,"True",0.75,0.75,"1","1",0,1,"TESLA 3-17-20WH",84,"35-091-21829-0000","35091218290000","044414","269133","00084","23500114421",null,"A61BE2A680924536831300084"]
["HAMILTON 4-14-26WH","A61BE2A680924536831700085","default","TxWells","All Cases","Proved","Producing","CARSON","WOODFORD / MAYES","HUGHES","OK","CALYX ENERGY III LLC",85,"35063249110000",35.161439999999999,-96.012609999999995,0,"15850","N  8.0/E  12.0/SEC  14.0  SW","0","0","Standard Case","Gas",1.0538988712777568,1102.9145867259285,0,0,0.79042415345831762,827.18594004444651,0,"Mbbl","MMcf","bbl",72.688000000000002,4.6500000000000004,0,57.454115477181006,3846.2997996259155,0,3903.753915103096,3.1616966138332705,1240.7789100666696,0,1243.9406066805034,331.39341067761808,160.20335112936343,1735.5373684874849,0,276.97134027656466,0,50,50,50,0,1841.2452063390467,1610.1365789557276,10,"M$",6.4996577686516082,null,"Seg1","2022-10-01","2029-03-31",null,null,37.82490412678095,62.500860600372008,2.7378507871321012E-2,"True",0.75,0.75,"1","1",0,1,"HAMILTON 4-14-26WH",85,"35-063-24911-0000","35063249110000","008500","269133","00085","23500114424",null,"A61BE2A680924536831700085"]
["HAMILTON 3-14-26WH","A61BE2A680924536832100086","default","TxWells","All Cases","Proved","Producing","CARSON","WOODFORD / MAYES","HUGHES","OK","CALYX ENERGY III LLC",86,"35063249120000",35.161369999999998,-96.01258,0,"15863","N  8.0/E  12.0/SEC  14.0  SW","0","0","Standard Case","Gas",0,485.27901839111394,0,0,0,363.95926379333542,0,"Mbbl","MMcf","bbl",0,4.5890000000000004,0,0,1670.3108957834611,0,1670.3108957834611,0,545.93889569000305,0,545.93889569000316,331.39341067761808,160.20335112936343,1037.5356574969846,0,118.50855805583655,0,50,50,50,0,464.26668023063974,416.08220716435204,10,"M$",6.4996577686516082,null,"Seg1","2022-10-01","2029-03-31",null,null,10.2853336046128,16.892697647864274,9.5824777549623541E-2,"True",0.75,0.75,"1","1",0,1,"HAMILTON 3-14-26WH",86,"35-063-24912-0000","35063249120000","008500","269133","00086","23500114425",null,"A61BE2A680924536832100086"]
["HAMILTON 2-14-26WH","A61BE2A680924536832300087","default","TxWells","All Cases","Proved","Producing","CARSON","WOODFORD","HUGHES","OK","CALYX ENERGY III LLC",87,"35063249130000",35.161360000000002,-96.012529999999998,0,"15852","N  8.0/E  12.0/SEC  14.0  SW","0","0","Standard Case","Gas",0,1761.1613894739244,0,0,0,1320.8710421054434,0,"Mbbl","MMcf","bbl",0,4.7910000000000004,0,0,6328.2677130989596,0,6328.2677130989596,0,1981.3065631581646,0,1981.3065631581637,1182.1331396303908,571.47089938398381,3734.9106021725383,0,448.99059424437127,0,50,50,50,0,2094.3665166820501,1441.4958667115559,10,"M$",23.164955509924699,null,"Seg1","2022-10-01","2045-11-29",null,null,42.887330333640982,290.46597779719332,8.2135523613963042E-3,"True",0.75,0.75,"1","1",0,1,"HAMILTON 2-14-26WH",87,"35-063-24913-0000","35063249130000","008500","269133","00087","23500114426",null,"A61BE2A680924536832300087"]
["FRANKLIN 2-12-24WH","A61BE2A680924536832400088","default","TxWells","All Cases","Proved","Producing","CARSON EAST","WOODFORD","HUGHES","OK","CALYX ENERGY III LLC",88,"35063249170000",35.179519999999997,-95.989519999999999,0,"15500","N  8.0/E  12.0/SEC  12.0  NESWNWSE","0","0","Standard Case","Gas",0,271.52326896218858,0,0,0,203.64245172164146,0,"Mbbl","MMcf","bbl",0,4.9089999999999998,0,0,999.59448050349999,0,999.59448050350011,0,305.4636775824622,0,305.4636775824622,105.25477763794132,50.882629396568859,461.60108461697234,0,70.921228391723332,0,50,50,50,0,417.07216749480438,401.93322517574722,10,"M$",2.0725530458589998,null,"Seg1","2022-10-01","2024-10-26",null,null,9.3414433498960907,10.878758252017215,6.8446269678302529E-2,"True",0.75,0.75,"1","1",0,1,"FRANKLIN 2-12-24WH",88,"35-063-24917-0000","35063249170000","008505","269133","00088","23500114445",null,"A61BE2A680924536832400088"]
["FRANKLIN 3-12-24WH","A61BE2A680924536832600089","default","TxWells","All Cases","Proved","Producing","CARSON EAST","WOODFORD","HUGHES","OK","CALYX ENERGY III LLC",89,"35063249160000",35.179519999999997,-95.989570000000001,0,"16322","N  8.0/E  12.0/SEC  12.0  NESWNWSE","0","0","Standard Case","Gas",5.4637972248560551,1772.0815071108229,0,0,4.0978479186420413,1329.0611303331168,0,"Mbbl","MMcf","bbl",63.567999999999998,4.7880000000000003,0,260.49045225023428,6363.4290861559921,0,6623.919538406225,16.391391674568165,1993.5916954996756,0,2009.9830871742433,1177.2826293303312,569.12604888388444,3756.3917653884591,0,469.96709124992157,0,50,50,50,0,2347.560681767844,1626.3220911670298,10,"M$",23.080082135523611,null,"Seg1","2022-10-01","2045-10-29",null,null,47.951213635356901,324.83214468333466,8.2135523613963042E-3,"True",0.75,0.75,"1","1",0,1,"FRANKLIN 3-12-24WH",89,"35-063-24916-0000","35063249160000","008505","269133","00089","23500114446",null,"A61BE2A680924536832600089"]
["FRANKLIN 4-12-24WH","A61BE2A680924536832900090","default","TxWells","All Cases","Proved","Producing","CARSON EAST","WOODFORD","HUGHES","OK","CALYX ENERGY III LLC",90,"35063249150000",35.179389999999998,-95.989609999999999,0,"16714","N  8.0/E  12.0/SEC  12.0  NESWNWSE","0","0","Standard Case","Gas",5.0492849493435063E-2,1060.9634986254061,0,0,3.7869637120076301E-2,795.72262396905455,0,"Mbbl","MMcf","bbl",80.185000000000002,4.5979999999999999,0,3.0365636034917847,3658.4172129953708,0,3661.4537765988625,0.1514785484803052,1193.5839359535817,0,1193.7354145020622,433.46541067761808,209.54735112936342,1836.7481763090436,0,259.78014544968926,0,50,50,50,0,1514.9254548401295,1272.6131740808712,10,"M$",8.4982888432580417,null,"Seg1","2022-10-01","2031-03-31",null,null,31.298509096802587,60.313652507046747,3.5592060232717312E-2,"True",0.75,0.75,"1","1",0,1,"FRANKLIN 4-12-24WH",90,"35-063-24915-0000","35063249150000","008505","269133","00090","23500114447",null,"A61BE2A680924536832900090"]
["KENNEDY 1-31-30WH","A61BE2A680924536833100091","default","TxWells","All Cases","Proved","Producing","DUSTIN","WOODFORD","HUGHES","OK","CALYX ENERGY III LLC",91,"35063249200000",35.202170000000002,-96.079859999999996,0,"15182","N  8.0/E  12.0/SEC  6.0  NWNWNWNE","0","0","Standard Case","Gas",0.17964565682731168,1388.7052745677183,0,0,0.13473424262048375,1041.528955925789,0,"Mbbl","MMcf","bbl",79.441000000000003,4.67,0,10.703466410045799,4864.2826408987476,0,4874.9861073087923,0.53893697048193512,1562.2934338886835,0,1562.8323708591654,700.58350308008221,338.67850513347025,2602.0943790727179,0,345.88026431355877,0,50,50,50,0,1877.0114639225162,1533.2558927477141,10,"M$",13.733059548254619,null,"Seg1","2022-10-01","2036-06-24",null,null,38.540229278450312,121.3577515528856,1.6427104722792598E-2,"True",0.75,0.75,"1","1",0,1,"KENNEDY 1-31-30WH",91,"35-063-24920-0000","35063249200000","014390","269133","00091","23500114449",null,"A61BE2A680924536833100091"]
["KENNEDY 2-31-30WH","A61BE2A680924536833200092","default","TxWells","All Cases","Proved","Producing","DUSTIN","WOODFORD","HUGHES","OK","CALYX ENERGY III LLC",92,"35063249190000",35.202170000000002,-96.079809999999995,0,"15328","N  8.0/E  12.0/SEC  6.0  NWNWNWNE","0","0","Standard Case","Gas",0.16439135996506171,822.14578496195804,0,0,0.12329351997379627,616.60933872146848,0,"Mbbl","MMcf","bbl",79.537000000000006,4.6310000000000002,0,9.8064253702362585,2855.5747371875414,0,2865.3811625577778,0.49317407989518514,924.91400808220283,0,925.40718216209825,382.42941067761808,184.87535112936345,1492.7119439690798,0,203.2987934834743,0,50,50,50,0,1119.3704251052241,981.8956509552346,10,"M$",7.4989733059548254,null,"Seg1","2022-10-01","2030-03-31",null,null,23.387408502104464,42.428928558403598,3.5592060232717312E-2,"True",0.75,0.75,"1","1",0,1,"KENNEDY 2-31-30WH",92,"35-063-24919-0000","35063249190000","014390","269133","00092","23500114450",null,"A61BE2A680924536833200092"]
["KENNEDY 3-31-30WH","A61BE2A680924536833400093","default","TxWells","All Cases","Proved","Producing","DUSTIN","WOODFORD","HUGHES","OK","CALYX ENERGY III LLC",93,"35063249180000",35.202170000000002,-96.079759999999993,0,"15342","N  8.0/E  12.0/SEC  6.0  NWNWNWNE","0","0","Standard Case","Gas",9.873353969467917E-2,60.293040034327582,0,0,7.4050154771009388E-2,45.219780025745685,0,"Mbbl","MMcf","bbl",82.421999999999997,5.0430000000000001,0,6.1033428966053949,228.05422146009528,0,234.15756435670068,0.29620061908403755,67.829670038618531,0,68.125870657702563,44.399438166523147,21.463730277538584,133.98903910176429,0,16.613479191107917,0,50,50,50,0,33.555046063828456,35.623301002853374,10,"M$",0.87885010266940455,null,"Seg1","2022-10-01","2023-08-17",null,null,1.6711009212765695,1.777419742558739,0.26283367556468168,"True",0.75,0.75,"1","1",0,1,"KENNEDY 3-31-30WH",93,"35-063-24918-0000","35063249180000","014390","269133","00093","23500114451",null,"A61BE2A680924536833400093"]
["RAPUNZEL 1-15-22WH","A61BE2A680924536833500094","default","TxWells","All Cases","Proved","Producing","CARSON EAST","WOODFORD / MAYES","HUGHES","OK","CALYX ENERGY III LLC",94,"35063249210000",35.174799999999998,-96.025739999999999,0,"15510","N  8.0/E  12.0/SEC  10.0  SESWSWSE","0","0","Standard Case","Gas",0.129290337433483,504.31483681196403,0,0,9.6967753075112254E-2,378.23612760897305,0,"Mbbl","MMcf","bbl",80.504000000000005,4.867,0,7.8062941611010732,1841.0423499390674,0,1848.8486441001683,0.38787101230044901,567.35419141345949,0,567.74206242575997,139.74641889117044,67.556698151950712,775.04517946888109,0,131.17581129890695,0,50,50,50,0,892.62765333238042,842.80854930136718,10,"M$",2.7460643394934969,null,"Seg1","2022-10-01","2025-06-29",null,null,18.852553066647602,23.151666427542377,3.8329911019849408E-2,"True",0.75,0.75,"1","1",0,1,"RAPUNZEL 1-15-22WH",94,"35-063-24921-0000","35063249210000","008505","269133","00094","23500114462",null,"A61BE2A680924536833500094"]
["RAPUNZEL 2-15-22WH","A61BE2A680924536833700095","default","TxWells","All Cases","Proved","Producing","CARSON EAST","WOODFORD / MAYES","HUGHES","OK","CALYX ENERGY III LLC",95,"35063249220000",35.174799999999998,-96.025790000000001,0,"15362","N  8.0/E  12.0/SEC  10.0  SESWSWSE","0","0","Standard Case","Gas",0.18234988275680844,730.94637822999255,0,0,0.13676241206760631,548.20978367249438,0,"Mbbl","MMcf","bbl",80.055000000000007,4.8250000000000002,0,10.948566807642914,2644.8381674563507,0,2655.7867342639943,0.54704964827042513,822.31467550874174,0,822.86172515701219,178.28541067761807,86.187351129363449,1087.3344869639936,0,188.42806879603035,0,50,50,50,0,1330.02417850397,1238.1170240114477,10,"M$",3.4989733059548249,null,"Seg1","2022-10-01","2026-03-31",null,null,27.600483570079394,36.075356632481892,2.7378507871321012E-2,"True",0.75,0.75,"1","1",0,1,"RAPUNZEL 2-15-22WH",95,"35-063-24922-0000","35063249220000","008505","269133","00095","23500114463",null,"A61BE2A680924536833700095"]
["RAPUNZEL 3-15-22WH","A61BE2A680924536833900096","default","TxWells","All Cases","Proved","Producing","CARSON EAST","WOODFORD","HUGHES","OK","CALYX ENERGY III LLC",96,"35063249230000",35.174799999999998,-96.025840000000002,0,"15476","N  8.0/E  12.0/SEC  10.0  SESWSWSE","0","0","Standard Case","Gas",0.63211137599627476,1053.5189599937917,0,0,0.47408353199720621,790.13921999534375,0,"Mbbl","MMcf","bbl",75.936999999999998,4.7480000000000002,0,36.000489760644832,3751.4406533362435,0,3787.4411430968889,1.8963341279888246,1185.2088299930156,0,1187.1051641210047,232.67490554414786,112.48050924024641,1532.2605789053989,0,268.7189491027242,0,50,50,50,0,1936.4616150887655,1755.8510020458457,10,"M$",4.5639972621492122,null,"Seg1","2022-10-01","2027-04-24",null,null,39.729232301775305,56.308235621881785,2.190280629705681E-2,"True",0.75,0.75,"1","1",0,1,"RAPUNZEL 3-15-22WH",96,"35-063-24923-0000","35063249230000","008505","269133","00096","23500114464",null,"A61BE2A680924536833900096"]

{"sheet":"InvOneLiner","index":3,"n_rows":81,"n_cols":12,"rows_kept":81,"cut":false,"hidden":false,"merged":[]}
["PHDWinID","CaseName","GrossTan","GrossInTan","NetTan","NetInTan","RskInfGrossTan","RskInfGrossInTan","RskInfNetTan","RskInfNetInTan","RskNetTan","RskNetInTan"]
[50001,"Grand Total"]
[1,"CHITWOOD NORTHWEST UNIT"]
[2,"SANDRA FIU 03041H-9X"]
[3,"SANDRA 03043H-9X"]
[4,"SANDRA FIU 03042H-9X"]
[5,"THOMAS ESTATE"]
[6,"HARWELL 1-33"]
[7,"HOLINSWORTH 3H-9X"]
[8,"HOLINSWORTH 7H-9X"]
[9,"HOLINSWORTH 5H-9X"]
[10,"HOLINSWORTH 2H-9X"]
[11,"SHIRLEY 1-32H"]
[12,"STEPHANIE 1-6H"]
[13,"RAUH 1-22H"]
[14,"FLOYD 1-8"]
[15,"CHARLOTTE 1-16"]
[16,"ATCHISON 1-31H"]
[17,"KENNY 1-24HA"]
[18,"RAUH 2-22H"]
[19,"JONES 1-4"]
[20,"HOLINSWORTH 8H-9X"]
[21,"COTTON 1-17-16XH"]
[22,"NANCY 1-4"]
[23,"JONES 2-4"]
[24,"ERIN 1"]
[25,"HOLINSWORTH 1H-16"]
[26,"SPARKS"]
[27,"MARY GRACE"]
[28,"HOLINSWORTH 4H-9X"]
[29,"HOLINSWORTH 6H-9X"]
[30,"WILLIAMS 3H-7X"]
[31,"EVANS 1-21"]
[32,"WILLIAMS 4H-7X"]
[33,"WILLIAMS 6H-7X"]
[34,"WILLIAMS 2H-7X"]
[35,"WILLIAMS 1H-7X"]
[36,"WILEY BROTHERS 1-20"]
[37,"JANET 1-16"]
[38,"WILLIAMS 5H-7X"]
[39,"HAYS N 3H-5X"]
[40,"HAYS N 6H-5X"]
[41,"COTTRELL 1-18"]
[42,"HURLEY 1-13"]
[43,"HAYS N 5H-5X"]
[44,"HAYS N 4H-5X"]
[45,"HAYS N 2H-5X"]
[46,"THE STERLING YULE SAND UNIT"]
[47,"GLADYS 1-12"]
[48,"FLOOD 1-11"]
[49,"HAYS N 7H-5XR"]
[50,"HAYS 1H-5XX"]
[51,"JACK 1-5H"]
[52,"JANE 1-22H"]
[53,"HAYS N 8H-5X"]
[54,"SISKO 1-8-5XH"]
[55,"LLOYD 1-11"]
[56,"WILLIAM 1-11"]
[57,"BOBBY 1-27"]
[58,"ACTION JACKSON 0404 1-34-27MX"]
[59,"WHITNEY 1-27-22MX"]
[60,"HILDENBRANDT 1-31"]
[61,"PARR 1-22"]
[62,"HILDERBRANDT 2-31"]
[63,"BRENT 6 31 MD 1H"]
[64,"JOHNSON 1"]
[65,"JOHN 1-20"]
[66,"BLOOMFIELD A 2"]
[67,"TADLOCK 1-33"]
[68,"GRAY LEONARD 1-19"]
[69,"KNIGHT 1-26"]
[70,"MANN 1-17"]
[71,"O W J"]
[72,"FRANKENBERG E 2-A"]
[73,"DOWNING 1"]
[74,"GRAY 1"]
[75,"WILKINS 1-27"]
[76,"SPEYSIDE 1-20-19XH"]
[77,"CORONA 1-31-30MX"]
[78,"ELIANA 5 32 NC 1H"]
[79,"JAMES TRUST 1-24-23XH"]

{"sheet":"PriceQC","index":4,"n_rows":80,"n_cols":13,"rows_kept":80,"cut":false,"hidden":false,"merged":[]}
["CaseName","Field","AsofOilPrice","OilPriceUnits","AsofGasPrice","GasPriceUnits","OilDiffPercent","OilDiffValue","GasDiffPercent","GasDiffValue","GasPriceModel","OilPriceModel","BTU"]
["CHITWOOD NORTHWEST UNIT","CHITWOOD NORTHWEST",71.02,"$/bbl",6.2450000000000001,"$/Mcf",0,0,0,0,"NYMEX 12 09 2022[6.245]","NYMEX 12 09 2022[71.02]",0]
["SANDRA FIU 03041H-9X","GOLDEN TREND",71.02,"$/bbl",6.2450000000000001,"$/Mcf",0,0,0,0,"NYMEX 12 09 2022[6.245]","NYMEX 12 09 2022[71.02]",0]
["SANDRA 03043H-9X","GOLDEN TREND",71.02,"$/bbl",6.2450000000000001,"$/Mcf",0,0,0,0,"NYMEX 12 09 2022[6.245]","NYMEX 12 09 2022[71.02]",0]
["SANDRA FIU 03042H-9X","GOLDEN TREND",71.02,"$/bbl",6.2450000000000001,"$/Mcf",0,0,0,0,"NYMEX 12 09 2022[6.245]","NYMEX 12 09 2022[71.02]",0]
["THOMAS ESTATE","GOLDEN TREND",71.02,"$/bbl",6.2450000000000001,"$/Mcf",0,0,0,0,"NYMEX 12 09 2022[6.245]","NYMEX 12 09 2022[71.02]",0]
["HARWELL 1-33","GOLDEN TREND",71.02,"$/bbl",6.2450000000000001,"$/Mcf",0,0,0,0,"NYMEX 12 09 2022[6.245]","NYMEX 12 09 2022[71.02]",0]
["HOLINSWORTH 3H-9X","GOLDEN TREND",71.02,"$/bbl",8.1185000000000009,"$/Mcf",0,0,0,0,"NYMEX 12 09 2022[8.1185]","NYMEX 12 09 2022[71.02]",1300]
["HOLINSWORTH 7H-9X","GOLDEN TREND",71.02,"$/bbl",8.1185000000000009,"$/Mcf",0,0,0,0,"NYMEX 12 09 2022[8.1185]","NYMEX 12 09 2022[71.02]",1300]
["HOLINSWORTH 5H-9X","GOLDEN TREND",71.02,"$/bbl",8.1185000000000009,"$/Mcf",0,0,0,0,"NYMEX 12 09 2022[8.1185]","NYMEX 12 09 2022[71.02]",1300]
["HOLINSWORTH 2H-9X","GOLDEN TREND",71.02,"$/bbl",8.1185000000000009,"$/Mcf",0,0,0,0,"NYMEX 12 09 2022[8.1185]","NYMEX 12 09 2022[71.02]",1300]
["SHIRLEY 1-32H","AMORITA",71.02,"$/bbl",6.2450000000000001,"$/Mcf",0,0,0,0,"NYMEX 12 09 2022[6.245]","NYMEX 12 09 2022[71.02]",0]
["STEPHANIE 1-6H","AMORITA",71.02,"$/bbl",6.2450000000000001,"$/Mcf",0,0,0,0,"NYMEX 12 09 2022[6.245]","NYMEX 12 09 2022[71.02]",0]
["RAUH 1-22H","CHEROKEE WEST",71.02,"$/bbl",6.2450000000000001,"$/Mcf",0,0,0,0,"NYMEX 12 09 2022[6.245]","NYMEX 12 09 2022[71.02]",0]
["FLOYD 1-8","GOLDEN TREND",71.02,"$/bbl",6.2450000000000001,"$/Mcf",0,0,0,0,"NYMEX 12 09 2022[6.245]","NYMEX 12 09 2022[71.02]",0]
["CHARLOTTE 1-16","GOLDEN TREND",71.02,"$/bbl",6.2450000000000001,"$/Mcf",0,0,0,0,"NYMEX 12 09 2022[6.245]","NYMEX 12 09 2022[71.02]",0]
["ATCHISON 1-31H","AMORITA",71.02,"$/bbl",6.2450000000000001,"$/Mcf",0,0,0,0,"NYMEX 12 09 2022[6.245]","NYMEX 12 09 2022[71.02]",0]
["KENNY 1-24HA","ARNETT SOUTHWEST",71.02,"$/bbl",6.2450000000000001,"$/Mcf",0,0,0,0,"NYMEX 12 09 2022[6.245]","NYMEX 12 09 2022[71.02]",0]
["RAUH 2-22H","CHEROKEE WEST",71.02,"$/bbl",6.2450000000000001,"$/Mcf",0,0,0,0,"NYMEX 12 09 2022[6.245]","NYMEX 12 09 2022[71.02]",0]
["JONES 1-4","GOLDEN TREND",71.02,"$/bbl",6.2450000000000001,"$/Mcf",0,0,0,0,"NYMEX 12 09 2022[6.245]","NYMEX 12 09 2022[71.02]",0]
["HOLINSWORTH 8H-9X","GOLDEN TREND",71.02,"$/bbl",8.1185000000000009,"$/Mcf",0,0,0,0,"NYMEX 12 09 2022[8.1185]","NYMEX 12 09 2022[71.02]",1300]
["COTTON 1-17-16XH","KATIE SOUTH",71.02,"$/bbl",8.1185000000000009,"$/Mcf",0,0,0,0,"NYMEX 12 09 2022[8.1185]","NYMEX 12 09 2022[71.02]",1300]
["NANCY 1-4","GOLDEN TREND",71.02,"$/bbl",6.2450000000000001,"$/Mcf",0,0,0,0,"NYMEX 12 09 2022[6.245]","NYMEX 12 09 2022[71.02]",0]
["JONES 2-4","GOLDEN TREND",71.02,"$/bbl",6.2450000000000001,"$/Mcf",0,0,0,0,"NYMEX 12 09 2022[6.245]","NYMEX 12 09 2022[71.02]",0]
["ERIN 1","FORT SILL",71.02,"$/bbl",6.2450000000000001,"$/Mcf",0,0,0,0,"NYMEX 12 09 2022[6.245]","NYMEX 12 09 2022[71.02]",0]
["HOLINSWORTH 1H-16","GOLDEN TREND",71.02,"$/bbl",8.1185000000000009,"$/Mcf",0,0,0,0,"NYMEX 12 09 2022[8.1185]","NYMEX 12 09 2022[71.02]",1300]
["SPARKS","GOLDEN TREND",71.02,"$/bbl",7.8062500000000004,"$/Mcf",0,0,0,0,"NYMEX 12 09 2022[7.80625]","NYMEX 12 09 2022[71.02]",1250]
["MARY GRACE","GOLDEN TREND",71.02,"$/bbl",8.1185000000000009,"$/Mcf",0,0,0,0,"NYMEX 12 09 2022[8.1185]","NYMEX 12 09 2022[71.02]",1300]
["HOLINSWORTH 4H-9X","GOLDEN TREND",71.02,"$/bbl",8.1185000000000009,"$/Mcf",0,0,0,0,"NYMEX 12 09 2022[8.1185]","NYMEX 12 09 2022[71.02]",1300]
["HOLINSWORTH 6H-9X","GOLDEN TREND",71.02,"$/bbl",8.1185000000000009,"$/Mcf",0,0,0,0,"NYMEX 12 09 2022[8.1185]","NYMEX 12 09 2022[71.02]",1300]
["WILLIAMS 3H-7X","FOSTER",71.02,"$/bbl",8.1185000000000009,"$/Mcf",0,0,0,0,"NYMEX 12 09 2022[8.1185]","NYMEX 12 09 2022[71.02]",1300]
["EVANS 1-21","GOLDEN TREND",71.02,"$/bbl",8.1185000000000009,"$/Mcf",0,0,0,0,"NYMEX 12 09 2022[8.1185]","NYMEX 12 09 2022[71.02]",1300]
["WILLIAMS 4H-7X","FOSTER",71.02,"$/bbl",8.1185000000000009,"$/Mcf",0,0,0,0,"NYMEX 12 09 2022[8.1185]","NYMEX 12 09 2022[71.02]",1300]
["WILLIAMS 6H-7X","GOLDEN TREND",71.02,"$/bbl",6.2450000000000001,"$/Mcf",0,0,0,0,"NYMEX 12 09 2022[6.245]","NYMEX 12 09 2022[71.02]",0]
["WILLIAMS 2H-7X","FOSTER",71.02,"$/bbl",8.1185000000000009,"$/Mcf",0,0,0,0,"NYMEX 12 09 2022[8.1185]","NYMEX 12 09 2022[71.02]",1300]
["WILLIAMS 1H-7X","FOSTER",71.02,"$/bbl",8.1185000000000009,"$/Mcf",0,0,0,0,"NYMEX 12 09 2022[8.1185]","NYMEX 12 09 2022[71.02]",1300]
["WILEY BROTHERS 1-20","WILDCAT",71.02,"$/bbl",6.2450000000000001,"$/Mcf",0,0,0,0,"NYMEX 12 09 2022[6.245]","NYMEX 12 09 2022[71.02]",0]
["JANET 1-16","KATIE SOUTH",71.02,"$/bbl",8.1185000000000009,"$/Mcf",0,0,0,0,"NYMEX 12 09 2022[8.1185]","NYMEX 12 09 2022[71.02]",1300]
["WILLIAMS 5H-7X","GOLDEN TREND",71.02,"$/bbl",6.2450000000000001,"$/Mcf",0,0,0,0,"NYMEX 12 09 2022[6.245]","NYMEX 12 09 2022[71.02]",0]
["HAYS N 3H-5X","GOLDEN TREND",71.02,"$/bbl",8.1185000000000009,"$/Mcf",0,0,0,0,"NYMEX 12 09 2022[8.1185]","NYMEX 12 09 2022[71.02]",1300]
["HAYS N 6H-5X","GOLDEN TREND",71.02,"$/bbl",8.1185000000000009,"$/Mcf",0,0,0,0,"NYMEX 12 09 2022[8.1185]","NYMEX 12 09 2022[71.02]",1300]
["COTTRELL 1-18","KATIE SOUTH",71.02,"$/bbl",6.2450000000000001,"$/Mcf",0,0,0,0,"NYMEX 12 09 2022[6.245]","NYMEX 12 09 2022[71.02]",0]
["HURLEY 1-13","KATIE SOUTH",71.02,"$/bbl",6.2450000000000001,"$/Mcf",0,0,0,0,"NYMEX 12 09 2022[6.245]","NYMEX 12 09 2022[71.02]",0]
["HAYS N 5H-5X","GOLDEN TREND",71.02,"$/bbl",8.1185000000000009,"$/Mcf",0,0,0,0,"NYMEX 12 09 2022[8.1185]","NYMEX 12 09 2022[71.02]",1300]
["HAYS N 4H-5X","GOLDEN TREND",71.02,"$/bbl",8.1185000000000009,"$/Mcf",0,0,0,0,"NYMEX 12 09 2022[8.1185]","NYMEX 12 09 2022[71.02]",1300]
["HAYS N 2H-5X","GOLDEN TREND",71.02,"$/bbl",8.1185000000000009,"$/Mcf",0,0,0,0,"NYMEX 12 09 2022[8.1185]","NYMEX 12 09 2022[71.02]",1300]
["THE STERLING YULE SAND UNIT","STERLING",71.02,"$/bbl",6.2450000000000001,"$/Mcf",0,0,0,0,"NYMEX 12 09 2022[6.245]","NYMEX 12 09 2022[71.02]",0]
["GLADYS 1-12","STERLING",71.02,"$/bbl",6.2450000000000001,"$/Mcf",0,0,0,0,"NYMEX 12 09 2022[6.245]","NYMEX 12 09 2022[71.02]",1000]
["FLOOD 1-11","STERLING WEST",71.02,"$/bbl",6.2450000000000001,"$/Mcf",0,0,0,0,"NYMEX 12 09 2022[6.245]","NYMEX 12 09 2022[71.02]",0]
["HAYS N 7H-5XR","PURDY SOUTHEAST",71.02,"$/bbl",8.1185000000000009,"$/Mcf",0,0,0,0,"NYMEX 12 09 2022[8.1185]","NYMEX 12 09 2022[71.02]",1300]
["HAYS 1H-5XX","FOSTER",71.02,"$/bbl",8.1185000000000009,"$/Mcf",0,0,0,0,"NYMEX 12 09 2022[8.1185]","NYMEX 12 09 2022[71.02]",1300]
["JACK 1-5H","AMORITA",71.02,"$/bbl",6.2450000000000001,"$/Mcf",0,0,0,0,"NYMEX 12 09 2022[6.245]","NYMEX 12 09 2022[71.02]",0]
["JANE 1-22H","CHEROKEE WEST",71.02,"$/bbl",6.2450000000000001,"$/Mcf",0,0,0,0,"NYMEX 12 09 2022[6.245]","NYMEX 12 09 2022[71.02]",0]
["HAYS N 8H-5X","GOLDEN TREND",71.02,"$/bbl",8.1185000000000009,"$/Mcf",0,0,0,0,"NYMEX 12 09 2022[8.1185]","NYMEX 12 09 2022[71.02]",1300]
["SISKO 1-8-5XH","GOLDEN TREND",71.02,"$/bbl",8.1185000000000009,"$/Mcf",0,0,0,0,"NYMEX 12 09 2022[8.1185]","NYMEX 12 09 2022[71.02]",1300]
["LLOYD 1-11","HILLSDALE NORTH",71.02,"$/bbl",6.2450000000000001,"$/Mcf",0,0,0,0,"NYMEX 12 09 2022[6.245]","NYMEX 12 09 2022[71.02]",0]
["WILLIAM 1-11","STERLING",71.02,"$/bbl",6.2450000000000001,"$/Mcf",0,0,0,0,"NYMEX 12 09 2022[6.245]","NYMEX 12 09 2022[71.02]",0]
["BOBBY 1-27","GOLDEN TREND",71.02,"$/bbl",8.1185000000000009,"$/Mcf",0,0,0,0,"NYMEX 12 09 2022[8.1185]","NYMEX 12 09 2022[71.02]",1300]
["ACTION JACKSON 0404 1-34-27MX","GOLDEN TREND",71.02,"$/bbl",8.1185000000000009,"$/Mcf",0,0,0,0,"NYMEX 12 09 2022[8.1185]","NYMEX 12 09 2022[71.02]",1300]
["WHITNEY 1-27-22MX","GOLDEN TREND",71.02,"$/bbl",8.1185000000000009,"$/Mcf",0,0,0,0,"NYMEX 12 09 2022[8.1185]","NYMEX 12 09 2022[71.02]",1300]
["HILDENBRANDT 1-31","GOLDEN TREND",71.02,"$/bbl",8.1185000000000009,"$/Mcf",0,0,0,0,"NYMEX 12 09 2022[8.1185]","NYMEX 12 09 2022[71.02]",1300]
["PARR 1-22","GOLDEN TREND",71.02,"$/bbl",8.1185000000000009,"$/Mcf",0,0,0,0,"NYMEX 12 09 2022[8.1185]","NYMEX 12 09 2022[71.02]",1300]
["HILDERBRANDT 2-31","GOLDEN TREND",71.02,"$/bbl",8.1185000000000009,"$/Mcf",0,0,0,0,"NYMEX 12 09 2022[8.1185]","NYMEX 12 09 2022[71.02]",1300]
["BRENT 6 31 MD 1H","GOODWIN WEST",71.02,"$/bbl",6.2450000000000001,"$/Mcf",0,0,0,0,"NYMEX 12 09 2022[6.245]","NYMEX 12 09 2022[71.02]",0]
["JOHNSON 1","STERLING",71.02,"$/bbl",6.2450000000000001,"$/Mcf",0,0,0,0,"NYMEX 12 09 2022[6.245]","NYMEX 12 09 2022[71.02]",0]
["JOHN 1-20","STERLING",71.02,"$/bbl",6.2450000000000001,"$/Mcf",0,0,0,0,"NYMEX 12 09 2022[6.245]","NYMEX 12 09 2022[71.02]",0]
["BLOOMFIELD A 2","GOLDEN TREND",71.02,"$/bbl",6.2450000000000001,"$/Mcf",0,0,0,0,"NYMEX 12 09 2022[6.245]","NYMEX 12 09 2022[71.02]",0]
["TADLOCK 1-33","GOLDEN TREND",71.02,"$/bbl",6.2450000000000001,"$/Mcf",0,0,0,0,"NYMEX 12 09 2022[6.245]","NYMEX 12 09 2022[71.02]",0]
["GRAY LEONARD 1-19","CHITWOOD",71.02,"$/bbl",6.2450000000000001,"$/Mcf",0,0,0,0,"NYMEX 12 09 2022[6.245]","NYMEX 12 09 2022[71.02]",0]
["KNIGHT 1-26","EDMOND WEST",71.02,"$/bbl",6.2450000000000001,"$/Mcf",0,0,0,0,"NYMEX 12 09 2022[6.245]","NYMEX 12 09 2022[71.02]",0]
["MANN 1-17","KATIE SOUTH",71.02,"$/bbl",8.1185000000000009,"$/Mcf",0,0,0,0,"NYMEX 12 09 2022[8.1185]","NYMEX 12 09 2022[71.02]",1300]
["O W J","GOLDEN TREND",71.02,"$/bbl",8.1185000000000009,"$/Mcf",0,0,0,0,"NYMEX 12 09 2022[8.1185]","NYMEX 12 09 2022[71.02]",1300]
["FRANKENBERG E 2-A","GOLDEN TREND",71.02,"$/bbl",6.2450000000000001,"$/Mcf",0,0,0,0,"NYMEX 12 09 2022[6.245]","NYMEX 12 09 2022[71.02]",0]
["DOWNING 1","NUMA",71.02,"$/bbl",6.2450000000000001,"$/Mcf",0,0,0,0,"NYMEX 12 09 2022[6.245]","NYMEX 12 09 2022[71.02]",0]
["GRAY 1","CHITWOOD NORTHWEST",71.02,"$/bbl",6.2450000000000001,"$/Mcf",0,0,0,0,"NYMEX 12 09 2022[6.245]","NYMEX 12 09 2022[71.02]",0]
["WILKINS 1-27","GOLDEN TREND",71.02,"$/bbl",6.2450000000000001,"$/Mcf",0,0,0,0,"NYMEX 12 09 2022[6.245]","NYMEX 12 09 2022[71.02]",0]
["SPEYSIDE 1-20-19XH","KATIE SOUTH",71.02,"$/bbl",7.8062500000000004,"$/Mcf",0,0,0,0,"NYMEX 12 09 2022[7.80625]","NYMEX 12 09 2022[71.02]",1250]
["CORONA 1-31-30MX","GOLDEN TREND",71.02,"$/bbl",8.1185000000000009,"$/Mcf",0,0,0,0,"NYMEX 12 09 2022[8.1185]","NYMEX 12 09 2022[71.02]",1300]
["ELIANA 5 32 NC 1H","GOODWIN SOUTH",71.02,"$/bbl",6.2450000000000001,"$/Mcf",0,0,0,0,"NYMEX 12 09 2022[6.245]","NYMEX 12 09 2022[71.02]",0]
["JAMES TRUST 1-24-23XH","KATIE SOUTH",71.02,"$/bbl",6.2450000000000001,"$/Mcf",0,0,0,0,"NYMEX 12 09 2022[6.245]","NYMEX 12 09 2022[71.02]",0]

{"sheet":"Projections","index":5,"n_rows":188,"n_cols":20,"rows_kept":188,"cut":false,"hidden":false,"merged":[]}
["UniqueId","Field","Case","Well","Reservoir","Product","Units","ProjType","Segment","StartDate","BegCum","Qi","NFactor","Decl","DeclMin","EndDate","Qf","Volume","EndCum","SolveFor"]
["A61BE2A680924536797500002","TIGER FLATS SOUTHEAST","KLIMEK 10-2H","10-2H","MISSISSIPPIAN","Gas","Mcf","Arps","1","8/1/2020 ",0,8193.5836947541484,1E-3,53.142770672797603,0,"5/31/2032 ",1.0417809036267127,126742.10721679303,0,"Vol;EDate"]
["A61BE2A680924536797800003","BEARDEN EAST","CHEATWOOD 15-1HX","15-1HX","MISSISSIPPIAN","Gas","Mcf","Arps","1","8/1/2019 ",0,16069.318627432991,1E-3,16.892285442504829,0,"7/31/2059 ",9.809594184608013,1037242.4489645625,0,"Vol;EDate"]
["A61BE2A680924536797800003","BEARDEN EAST","CHEATWOOD 15-1HX","15-1HX","MISSISSIPPIAN","Oil","bbl","Arps","1","11/1/2020 ",0,17.427957583264298,1E-3,80.046995775779109,0,"6/30/2022 ",1.1965958139971897,106.988715101869,0,"Vol;EDate"]
["A61BE2A680924536798100004","GREASY CREEK","FIELDS 19-1HX","19-1HX","MISSISSIPPIAN","Gas","Mcf","Arps","1","2/1/2021 ",0,17301.255838173107,1,29.244138622814862,0,"1/31/2061 ",1168.115552047339,1608442.1797876246,0,"Vol;EDate"]
["A61BE2A680924536798100004","GREASY CREEK","FIELDS 19-1HX","19-1HX","MISSISSIPPIAN","Oil","bbl","Arps","1","3/1/2021 ",0,2.634094946666707,1,10.04123994269176,0,"6/30/2036 ",1.0046914677242886,453.09737493816715,0,"Vol;EDate"]
["A61BE2A680924536798300005","GREASY CREEK","MEADORS 25-1H","25-1H","MISSISSIPPIAN","Gas","Mcf","Arps","1","2/1/2021 ",0,6721.1513271686126,1E-3,35.255101165858385,0,"3/31/2041 ",1.0496831745319564,182595.31157552518,0,"Vol;EDate"]
["A61BE2A680924536798300005","GREASY CREEK","MEADORS 25-1H","25-1H","MISSISSIPPIAN","Oil","bbl","Arps","1","2/1/2021 ",0,3.1069347662112259,1,10.04123994269176,0,"11/30/2040 ",1.0032046605572615,575.50517859094475,0,"Vol;EDate"]
["A61BE2A680924536798600006","GREASY CREEK","MEADORS 25-2H","25-2H","MISSISSIPPIAN","Gas","Mcf","Arps","1","7/1/2018 ",0,9149.2288355492783,1E-3,9.9475157104010883,0,"6/30/2058 ",138.42432691273402,1027664.4612810883,0,"Vol;EDate"]
["A61BE2A680924536798600006","GREASY CREEK","MEADORS 25-2H","25-2H","MISSISSIPPIAN","Oil","bbl","Arps","1","10/1/2020 ",0,5.8472822028004092,1E-3,15.018751777986717,0,"7/31/2031 ",1.0033605362444071,344.56012052025409,0,"Vol;EDate"]
["A61BE2A680924536799100007","GREASY CREEK","MEADORS 36-1HX","36-1HX","MISSISSIPPIAN","Gas","Mcf","Arps","1","2/1/2021 ",0,19560.504163587098,1E-3,59.010640263190481,0,"1/31/2032 ",1.0753698630327617,256997.99244007582,0,"Vol;EDate"]
["A61BE2A680924536799100007","GREASY CREEK","MEADORS 36-1HX","36-1HX","MISSISSIPPIAN","Oil","bbl","Arps","1","12/1/2020 ",0,10.934964046981811,1E-3,13.87441881292073,0,"11/30/2036 ",1.0021483346706841,778.90767527934156,0,"Vol;EDate"]
["A61BE2A680924536799500008","DUSTIN SOUTH","WASHINGTON 2-19-18CH","2-19-18CH","MISSISSIPPIAN","Gas","Mcf","Arps","1","2/1/2020 ",0,13619.27756210466,1E-3,19.980010998098606,0,"1/31/2060 ",1.8284941071581042,742296.9039317948,0,"Vol;EDate"]
["A61BE2A680924536799500008","DUSTIN SOUTH","WASHINGTON 2-19-18CH","2-19-18CH","MISSISSIPPIAN","Oil","bbl","Arps","1","9/1/2020 ",0,10.859250783452751,1E-3,18.361328959266999,0,"4/30/2032 ",1.0191087352041162,555.30234107229239,0,"Vol;EDate"]
["A61BE2A680924536799900009","DUSTIN SOUTH","WASHINGTON 1-19-18WH","1-19-18WH","WOODFORD","Gas","Mcf","Arps","1","2/1/2021 ",0,34363.740151623941,1E-3,50.230793803191041,0,"11/30/2035 ",1.1029944477110767,587561.20349719014,0,"Vol;EDate"]
["A61BE2A680924536799900009","DUSTIN SOUTH","WASHINGTON 1-19-18WH","1-19-18WH","WOODFORD","Oil","bbl","Arps","1","9/1/2020 ",0,14.780708240729144,1E-3,44.36225168529451,0,"2/28/2025 ",1.0592319019260368,251.29308736060764,0,"Vol;EDate"]
["A61BE2A680924536800400010","CARSON","ADAMS 2-36-25CH","2-36-25CH","MISSISSIPPIAN","Gas","Mcf","Arps","1","1/1/2021 ",0,26063.544726975651,1E-3,10,0,"12/31/2060 ",385.24220364770161,2948709.8484798563,0,"Vol;EDate"]
["A61BE2A680924536800400010","CARSON","ADAMS 2-36-25CH","2-36-25CH","MISSISSIPPIAN","Oil","bbl","Arps","1","2/1/2021 ",0,21.774161396034255,1E-3,67.246401414207412,0,"9/30/2023 ",1.1167427126732183,203.63658518882937,0,"Vol;EDate"]
["A61BE2A680924536802100011","CARSON","ADAMS 1-36-25WH","1-36-25WH","WOODFORD","Gas","Mcf","Arps","1","2/1/2021 ",0,32741.566389333893,1E-3,16.892285442504829,0,"1/31/2061 ",19.987249409533575,2114675.6952805603,0,"Vol;EDate"]
["A61BE2A680924536802100011","CARSON","ADAMS 1-36-25WH","1-36-25WH","WOODFORD","Oil","bbl","Arps","1","11/1/2020 ",0,24.293529788513364,1E-3,45.101499056644776,0,"12/31/2025 ",1.096416581858896,437.79276168989219,0,"Vol;EDate"]
["A61BE2A680924536802700012","CARSON","ADAMS 1-35-26WH","1-35-26WH","WOODFORD","Gas","Mcf","Arps","1","2/1/2021 ",0,30225.201204602112,1E-3,10,0,"1/31/2061 ",446.75516088587028,3400087.9923594589,0,"Vol;EDate"]
["A61BE2A680924536802700012","CARSON","ADAMS 1-35-26WH","1-35-26WH","WOODFORD","Oil","bbl","Arps","1","10/1/2020 ",0,21.143738591345812,1E-3,4.5736548192073627,0,"9/30/2060 ",3.250224871125035,4535.4467252965951,0,"Vol;EDate"]
["A61BE2A680924536803400013","DUSTIN","JEFFERSON 1-29-32WH","1-29-32WH","WOODFORD","Gas","Mcf","Arps","1","7/1/2018 ",0,37249.614009584111,1,49.845249071189848,0,"6/30/2058 ",1305.4420990879371,2234562.3174579474,0,"Vol;EDate"]
["A61BE2A680924536803400013","DUSTIN","JEFFERSON 1-29-32WH","1-29-32WH","WOODFORD","Oil","bbl","Arps","1","12/1/2020 ",0,12.914845797830509,1E-3,72.990360651714624,0,"9/30/2022 ",1.1744821620615391,99.792754456971522,0,"Vol;EDate"]
["A61BE2A680924536803700014","DUSTIN","JEFFERSON 1-20-17WH","1-20-17WH","WOODFORD","Gas","Mcf","Arps","1","7/1/2018 ",0,77158.014883329888,1,45.67334766926183,0,"6/30/2058 ",3043.8841450738105,5033556.1691783033,0,"Vol;EDate"]
["A61BE2A680924536803700014","DUSTIN","JEFFERSON 1-20-17WH","1-20-17WH","WOODFORD","Oil","bbl","Arps","1","11/1/2020 ",0,30.115208012787075,1E-3,61.91275864537765,0,"4/30/2024 ",1.0306052598206861,323.14539244114349,0,"Vol;EDate"]
["A61BE2A680924536804000015","DUSTIN","JEFFERSON 2-20-17CH","2-20-17CH","MISSISSIPPIAN","Gas","Mcf","Arps","1","1/1/2018 ",0,63792.699663810556,0.84463125000000006,56.917507514435307,0,"12/31/2057 ",1162.6986171742831,2713897.3057447383,0,"Vol;EDate"]
["A61BE2A680924536804000015","DUSTIN","JEFFERSON 2-20-17CH","2-20-17CH","MISSISSIPPIAN","Oil","bbl","Arps","1","12/1/2020 ",0,25.684977846386101,1E-3,88.724800310297908,0,"3/31/2022 ",1.4074727463689869,130.31933111875185,0,"Vol;EDate"]
["A61BE2A680924536804400016","CARSON","GRANT 2-2-35WH","2-2-35WH","WOODFORD","Gas","Mcf","Arps","1","9/1/2018 ",0,47419.833465642165,0.79150624999999997,46.996466725663247,0,"8/31/2058 ",1006.6709097975393,2408261.9939062675,0,"Vol;EDate"]
["A61BE2A680924536804700017","CARSON","GRANT 1-2-35WH","1-2-35WH","WOODFORD","Gas","Mcf","Arps","1","12/1/2019 ",0,39144.273764495752,1,99.268410243419837,0,"11/30/2059 ",198.84093152335214,766848.0140575649,0,"Vol;EDate"]
["A61BE2A680924536804700017","CARSON","GRANT 1-2-35WH","1-2-35WH","WOODFORD","Yield","bbl/Mcf","Arps","1","7/1/5664 ",0,{"$error":"#NUM!"},1E-3,10,0,"7/31/5704 ",{"$error":"#NUM!"},0,0,"EDate"]
["A61BE2A680924536805100018","DUSTIN","CARVER 1-8-5WH","1-8-5WH","MISSISSIPPIAN","Gas","Mcf","Arps","1","2/1/2021 ",0,11001.067915595531,0.31806875000000007,66.908030504379923,0,"1/31/2061 ",2.1751662760260206,171567.00500916608,0,"Vol;EDate"]
["A61BE2A680924536805100018","DUSTIN","CARVER 1-8-5WH","1-8-5WH","MISSISSIPPIAN","Oil","bbl","Arps","1","2/1/2021 ",0,7.8791635212844859,1E-3,10,0,"7/31/2040 ",1.0101393838772843,768.69298870562341,0,"Vol;EDate"]
["A61BE2A680924536805400019","DUSTIN","CARVER 1-9-4WH","1-9-4WH","WOODFORD","Gas","Mcf","Arps","1","3/1/2021 ",0,13588.944724775931,1E-3,7.0926289787444201,0,"2/28/2061 ",716.46103615296943,2092454.5706320142,0,"Vol;EDate"]
["A61BE2A680924536805400019","DUSTIN","CARVER 1-9-4WH","1-9-4WH","WOODFORD","Oil","bbl","Arps","1","2/1/2021 ",0,8.0331481543234595,0.80713124999999997,10.033226353690971,0,"1/31/2061 ",1.2765166372017098,1401.3090085538693,0,"Vol;EDate"]
["A61BE2A680924536805700020","DUSTIN","CARVER 1-16-21WH","1-16-21WH","WOODFORD","Gas","Mcf","Arps","1","10/1/2018 ",0,42241.484644038515,0.56806875000000001,31.929928496836467,0,"9/30/2058 ",768.30955170994741,2540078.5068425899,0,"Vol;EDate"]
["A61BE2A680924536805700020","DUSTIN","CARVER 1-16-21WH","1-16-21WH","WOODFORD","Oil","bbl","Arps","1","1/1/2021 ",0,7.1977380696112148,1E-3,10,0,"8/31/2039 ",1.0073525536792232,717.42106996313203,0,"Vol;EDate"]
["A61BE2A680924536806000021","GREASY CREEK","BARGER 1-26-23CH","1-26-23CH","MISSISSIPPIAN","Gas","Mcf","Arps","1","5/1/2018 ",0,56694.072569604999,1,66.46236514893333,0,"4/30/2058 ",1271.9032786012035,2503653.7527942499,0,"Vol;EDate"]
["A61BE2A680924536806000021","GREASY CREEK","BARGER 1-26-23CH","1-26-23CH","MISSISSIPPIAN","Oil","bbl","Arps","1","11/1/2020 ",0,20.950804308723438,1E-3,58.545638525732038,0,"2/29/2024 ",1.1168770165443065,239.61367179340982,0,"Vol;EDate"]
["A61BE2A680924536806500022","GREASY CREEK","BARGER EAST 1-35-2CH","1-35-2CH","MISSISSIPPIAN","Gas","Mcf","Arps","1","5/1/2018 ",0,44131.319213827352,0.83056874999999997,37.715022308259805,0,"4/30/2058 ",1484.8632255729117,2885011.139565126,0,"Vol;EDate"]
["A61BE2A680924536806500022","GREASY CREEK","BARGER EAST 1-35-2CH","1-35-2CH","MISSISSIPPIAN","Oil","bbl","Arps","1","1/1/2021 ",0,15.869345403436865,1E-3,99.986683535398214,0,"2/28/2021 ",3.75421525428498,37,0,"Vol;EDate"]
["A61BE2A680924536806800023","DUSTIN WEST","MADISON 1-23-14WH","1-23-14WH","WOODFORD","Gas","Mcf","Arps","1","1/1/2019 ",0,85842.521082390114,1,69.285353510605276,0,"12/31/2058 ",1785.4888426980883,3612502.1273186686,0,"Vol;EDate"]
["A61BE2A680924536806800023","DUSTIN WEST","MADISON 1-23-14WH","1-23-14WH","WOODFORD","Oil","bbl","Arps","1","1/1/2021 ",0,90.232285931734566,1E-3,89.63989005153195,0,"10/31/2022 ",1.4186703558871763,393.59009862356152,0,"Vol;EDate"]
["A61BE2A680924536807100024","DUSTIN WEST","MADISON 1-24-13WH","1-24-13WH","WOODFORD","Gas","Mcf","Arps","1","2/1/2021 ",0,17009.761718466652,1E-3,36.115353381687676,0,"9/30/2042 ",1.0356699752091372,446052.03383920278,0,"Vol;EDate"]
["A61BE2A680924536807100024","DUSTIN WEST","MADISON 1-24-13WH","1-24-13WH","WOODFORD","Oil","bbl","Arps","1","3/1/2021 ",0,1.9673868860719999,1,10.04123994269176,0,"2/28/2030 ",1.0079117986639929,340.59124969737235,0,"Vol;EDate"]
["A61BE2A680924536807300025","DUSTIN WEST","MADISON 2-23-14CH","2-23-14CH","MISSISSIPPIAN","Gas","Mcf","Arps","1","1/1/2019 ",0,40922.54848830738,1E-3,11.932852057182908,0,"12/31/2058 ",253.81655733129173,3852238.5294772931,0,"Vol;EDate"]
["A61BE2A680924536807300025","DUSTIN WEST","MADISON 2-23-14CH","2-23-14CH","MISSISSIPPIAN","Oil","bbl","Arps","1","2/1/2021 ",0,53.523784438372147,1E-3,99.987545002635215,0,"5/31/2021 ",2.7906336986492253,81,0,"Vol;EDate"]
["A61BE2A680924536807600026","DUSTIN WEST","MADISON 2-24-13CH","2-24-13CH","MISSISSIPPIAN","Gas","Mcf","Arps","1","1/1/2019 ",0,39396.221250349976,9.3068749999999992E-2,24.680337269814,0,"12/31/2058 ",17.142111265138883,1860104.4525273191,0,"Vol;EDate"]
["A61BE2A680924536807600026","DUSTIN WEST","MADISON 2-24-13CH","2-24-13CH","MISSISSIPPIAN","Oil","bbl","Arps","1","2/1/2021 ",0,28.286512585836327,1E-3,99.93695033751348,0,"5/31/2021 ",2.5126990762358226,58,0,"Vol;EDate"]
["A61BE2A680924536807800027","CARSON","LINCOLN 1-13-12WH","1-13-12WH","WOODFORD","Gas","Mcf","Arps","1","10/1/2020 ",0,37517.965295541042,1E-3,10,0,"9/30/2060 ",554.54865323337663,4208359.3098689429,0,"Vol;EDate"]
["A61BE2A680924536807800027","CARSON","LINCOLN 1-13-12WH","1-13-12WH","WOODFORD","Oil","bbl","Arps","1","2/1/2021 ",0,31.719202715801735,1E-3,97.915653475013613,0,"11/30/2021 ",1.2787692302559373,98.479181608507886,0,"Vol;EDate"]
["A61BE2A680924536809600028","CARSON","LINCOLN 1-14-11WH","1-14-11WH","WOODFORD","Gas","Mcf","Arps","1","3/1/2019 ",0,51518.406511412555,1,74.792338188594059,0,"2/28/2059 ",920.78735086764107,1905569.7700582077,0,"Vol;EDate"]
["A61BE2A680924536809600028","CARSON","LINCOLN 1-14-11WH","1-14-11WH","WOODFORD","Oil","bbl","Arps","1","2/1/2021 ",0,13.848058012424696,1E-3,85.323374963143152,0,"5/31/2022 ",1.0833957118623583,69.685672085243695,0,"Vol;EDate"]
["A61BE2A680924536809900029","PAPOOSE","THUNDER 1-18-6MH","1-18-6MH","MISSISSIPPIAN","Gas","Mcf","Arps","1","4/1/2020 ",0,20419.862473975922,1E-3,97.890901436618293,0,"9/30/2022 ",1.3208957689883118,27331.784611366966,0,"Vol;EDate"]
["A61BE2A680924536809900029","PAPOOSE","THUNDER 1-18-6MH","1-18-6MH","MISSISSIPPIAN","Oil","bbl","Arps","1","1/1/2021 ",0,86.857584176305821,1E-3,10,0,"12/31/2060 ",1.2838317842838773,9845.7438170709938,0,"Vol;EDate"]
["A61BE2A680924536810200030","CARSON","LINCOLN 1-23-26WH","1-23-26WH","WOODFORD","Gas","Mcf","Arps","1","9/1/2020 ",0,24646.095493941204,1E-3,7.4383876257699484,0,"8/31/2060 ",1119.3981232341146,3635976.2162223998,0,"Vol;EDate"]
["A61BE2A680924536810200030","CARSON","LINCOLN 1-23-26WH","1-23-26WH","WOODFORD","Oil","bbl","Arps","1","12/1/2020 ",0,19.594260200963973,1E-3,81.120034243100505,0,"7/31/2022 ",1.2216614185127193,121.73067091289158,0,"Vol;EDate"]
["A61BE2A680924536810800031","CARSON","LINCOLN 1-24-25WH","1-24-25WH","WOODFORD","Gas","Mcf","Arps","1","10/1/2020 ",0,39320.653570558185,1E-3,37.244602650963976,0,"5/31/2043 ",1.0199979383890612,986976.42744949262,0,"Vol;EDate"]
["A61BE2A680924536810800031","CARSON","LINCOLN 1-24-25WH","1-24-25WH","WOODFORD","Oil","bbl","Arps","1","11/1/2020 ",0,27.418499887037107,1E-3,33.202527557454417,0,"12/31/2028 ",1.0159148099064061,727.89640602121972,0,"Vol;EDate"]
["A61BE2A680924536811300032","GILCREASE DISTRICT EAST","THUNDER 1-13-25CH","1-13-25CH","MISSISSIPPIAN","Gas","Mcf","Arps","1","2/1/2021 ",0,21065.557264535353,1E-3,39.246741343409752,0,"11/30/2040 ",1.0757289605707201,499394.83451290283,0,"Vol;EDate"]
["A61BE2A680924536811300032","GILCREASE DISTRICT EAST","THUNDER 1-13-25CH","1-13-25CH","MISSISSIPPIAN","Oil","bbl","Arps","1","12/1/2020 ",0,20.896624274719578,1E-3,79.331553067572969,0,"9/30/2022 ",1.1640691967940795,140.86111067598375,0,"Vol;EDate"]
["A61BE2A680924536811700033","GREASY CREEK","THUNDER 1-18-30CH","1-18-30CH","MISSISSIPPIAN","Gas","Mcf","Arps","1","11/1/2018 ",0,40226.649602049809,1,39.238746003822953,0,"10/31/2058 ",1926.0953921353366,2976821.0696427631,0,"Vol;EDate"]
["A61BE2A680924536811700033","GREASY CREEK","THUNDER 1-18-30CH","1-18-30CH","MISSISSIPPIAN","Oil","bbl","Arps","1","9/1/2020 ",0,16.731191011057561,1E-3,21.572432168976196,0,"2/29/2032 ",1.0240348228022407,736.04998695662232,0,"Vol;EDate"]
["A61BE2A680924536812000034","DUSTIN","TRUMAN 4-19-18CH","4-19-18CH","MISSISSIPPIAN","Gas","Mcf","Arps","1","2/1/2021 ",0,25467.929831561119,1E-3,16.110752158874565,0,"1/31/2061 ",22.607142103340166,1736498.4038861757,0,"Vol;EDate"]
["A61BE2A680924536812000034","DUSTIN","TRUMAN 4-19-18CH","4-19-18CH","MISSISSIPPIAN","Oil","bbl","Arps","1","2/1/2021 ",0,117.61041289521521,1E-3,99.999851072911156,0,"5/31/2021 ",1.4322616044329681,132,0,"Vol;EDate"]
["A61BE2A680924536813900035","DUSTIN","TRUMAN 3-19-18CH","3-19-18CH","MISSISSIPPIAN","Gas","Mcf","Arps","1","2/1/2021 ",0,28060.485435717852,1E-3,14.443852087082776,0,"1/31/2061 ",54.71974754362256,2151628.4715930214,0,"Vol;EDate"]
["A61BE2A680924536813900035","DUSTIN","TRUMAN 3-19-18CH","3-19-18CH","MISSISSIPPIAN","Oil","bbl","Arps","1","1/1/2021 ",0,70.295722292826852,1E-3,87.836093253091079,0,"12/31/2022 ",1.0431038021445596,338.9443392379718,0,"Vol;EDate"]
["A61BE2A680924536821600052","PAPOOSE NORTH","CHEATWOOD 1-15-27CH","1-15-27CH","MISSISSIPPIAN","Oil","bbl","Arps","1","1/1/2021 ",0,89.579082725925304,1E-3,93.033270893208666,0,"8/31/2022 ",1.0624223411938405,318.17812922619214,0,"Vol;EDate"]
["A61BE2A680924536821800053","PAPOOSE NORTH","CHEATWOOD 1-16-28CH","1-16-28CH","MISSISSIPPIAN","Gas","Mcf","Arps","1","8/1/2019 ",0,35160.141158710794,1,55.658751381077273,0,"7/31/2059 ",1051.2784288315477,1861830.3194214646,0,"Vol;EDate"]
["A61BE2A680924536821800053","PAPOOSE NORTH","CHEATWOOD 1-16-28CH","1-16-28CH","MISSISSIPPIAN","Oil","bbl","Arps","1","9/1/2020 ",0,11.846650091401024,1E-3,2.4224168609735863,0,"8/31/2060 ",4.4421972884399352,3590.8077866022468,0,"Vol;EDate"]
["A61BE2A680924536822000054","SCIPIO NORTHWEST","OSCAR LU 2-17-20CH","2-17-20CH","CANEY","Gas","Mcf","Arps","1","3/1/2019 ",0,134935.13084272484,1,99.995845841959365,0,"2/28/2059 ",335.21373589778631,1303615.1995075145,0,"Vol;EDate"]
["A61BE2A680924536822000054","SCIPIO NORTHWEST","OSCAR LU 2-17-20CH","2-17-20CH","CANEY","Oil","bbl","Arps","1","11/1/2020 ",0,14.150236587459695,1E-3,52.823635014619207,0,"4/30/2024 ",1.0233581241653578,187.56083163595213,0,"Vol;EDate"]
["A61BE2A680924536822300055","WELEETKA DISTRICT EAST","SCRANTON 2-19-31MH","2-19-31MH","MISSISSIPPIAN","Gas","Mcf","Arps","1","10/1/2019 ",0,60707.326683320825,1,78.08869945876846,0,"9/30/2059 ",986.57489957899054,2140811.314321287,0,"Vol;EDate"]
["A61BE2A680924536822300055","WELEETKA DISTRICT EAST","SCRANTON 2-19-31MH","2-19-31MH","MISSISSIPPIAN","Oil","bbl","Arps","1","3/1/2021 ",0,17.012799771919102,1,10.04123994269176,0,"2/28/2061 ",3.2539637019893712,3498.1615370319587,0,"Vol;EDate"]
["A61BE2A680924536825300066","HANNA NORTHWEST","MIFFLIN 1-15-27CH","1-15-27CH","MISSISSIPPIAN","Gas","Mcf","Arps","1","3/1/2020 ",0,46139.530548355593,1,76.493764070072274,0,"2/29/2060 ",785.56257923378007,1666324.0913005678,0,"Vol;EDate"]
["A61BE2A680924536825300066","HANNA NORTHWEST","MIFFLIN 1-15-27CH","1-15-27CH","MISSISSIPPIAN","Oil","bbl","Arps","1","2/1/2021 ",0,14.202164602276675,1E-3,39.959731725659807,0,"3/31/2026 ",1.0207759727167778,284.43139919813609,0,"Vol;EDate"]
["A61BE2A680924536825700067","HANNA NORTHWEST","MIFFLIN 1-15-3CH","1-15-3CH","MISSISSIPPIAN","Gas","Mcf","Arps","1","9/1/2019 ",0,65077.84828342923,0.51025624999999997,60.343460893610057,0,"8/31/2059 ",185.73525427308741,1627165.6924808393,0,"Vol;EDate"]
["A61BE2A680924536825700067","HANNA NORTHWEST","MIFFLIN 1-15-3CH","1-15-3CH","MISSISSIPPIAN","Oil","bbl","Arps","1","12/1/2020 ",0,30.225553188567886,1E-3,95.962808906409066,0,"11/30/2021 ",1.2229470429679108,112.7853271056094,0,"Vol;EDate"]
["A61BE2A680924536826100068","SCIPIO NORTHWEST","EDISON 2-18-19WH","2-18-19WH","WOODFORD","Gas","Mcf","Arps","1","1/1/2020 ",0,241459.16988427425,1,97.471444437677462,0,"12/31/2059 ",1636.9059964453056,3971184.7393502239,0,"Vol;EDate"]
["A61BE2A680924536826100068","SCIPIO NORTHWEST","EDISON 2-18-19WH","2-18-19WH","WOODFORD","Oil","bbl","Arps","1","2/1/2021 ",0,19.727301963016622,1E-3,82.411067486822091,0,"9/30/2022 ",1.0983727114570225,115.98659604899731,0,"Vol;EDate"]
["A61BE2A680924536826500069","SCIPIO NORTHWEST","EDISON 3-18-19WH","3-18-19WH","WOODFORD","Gas","Mcf","Arps","1","9/1/2020 ",0,57399.97695231119,1E-3,17.996520631500022,0,"8/31/2060 ",20.521207195107479,3428588.2343713818,0,"Vol;EDate"]
["A61BE2A680924536826500069","SCIPIO NORTHWEST","EDISON 3-18-19WH","3-18-19WH","WOODFORD","Oil","bbl","Arps","1","1/1/2020 ",0,33.249987111370814,1,87.423629840623107,0,"6/30/2035 ",1.0061891034293076,723.39956031968586,0,"Vol;EDate"]
["A61BE2A680924536826800070","SCIPIO NORTHWEST","EDISON 4-18-19WH","4-18-19WH","WOODFORD / MAYES","Gas","Mcf","Arps","1","1/1/2020 ",0,242871.23409848762,0.76650624999999994,93.635954721943278,0,"12/31/2059 ",733.16016386010187,3256822.7391586108,0,"Vol;EDate"]
["A61BE2A680924536826800070","SCIPIO NORTHWEST","EDISON 4-18-19WH","4-18-19WH","WOODFORD / MAYES","Oil","bbl","Arps","1","1/1/2021 ",0,25.004610808839058,1,65.969264463040588,0,"2/28/2043 ",1.0070088700013937,889.31393865212397,0,"Vol;EDate"]
["A61BE2A680924536827000071","OKEMAH","TIMBERWOLF 1-19-18CH","1-19-18CH","MISSISSIPPIAN","Gas","Mcf","Arps","1","2/1/2020 ",0,69722.72881147459,0.87900624999999999,58.7585552630877,0,"1/31/2060 ",1345.3949350657672,2967117.1139831934,0,"Vol;EDate"]
["A61BE2A680924536827000071","OKEMAH","TIMBERWOLF 1-19-18CH","1-19-18CH","MISSISSIPPIAN","Oil","bbl","Arps","1","12/1/2020 ",0,41.537270288634367,1E-3,74.538498043846772,0,"7/31/2023 ",1.085813583195866,333.12067352744407,0,"Vol;EDate"]
["A61BE2A680924536827300072","OKEMAH","TIMBERWOLF 1-24-13CH","1-24-13CH","MISSISSIPPIAN","Gas","Mcf","Arps","1","2/1/2020 ",0,70967.498303009808,0.39150625000000006,45.668646454220053,0,"1/31/2060 ",172.5945445722312,2237422.7581348782,0,"Vol;EDate"]
["A61BE2A680924536827300072","OKEMAH","TIMBERWOLF 1-24-13CH","1-24-13CH","MISSISSIPPIAN","Oil","bbl","Arps","1","11/1/2020 ",0,45.734342317510141,1E-3,23.64268872535381,0,"12/31/2034 ",1.0017205961499291,1893.4925278972355,0,"Vol;EDate"]
["A61BE2A680924536827500073","CARSON","EISENHOWER 3-26-25WH","3-26-25WH","WOODFORD","Gas","Mcf","Arps","1","3/1/2020 ",0,205604.23487400115,1E-3,42.598397298644883,0,"2/28/2042 ",1.0225639464623091,4347093.3058898458,0,"Vol;EDate"]
["A61BE2A680924536827500073","CARSON","EISENHOWER 3-26-25WH","3-26-25WH","WOODFORD","Oil","bbl","Arps","1","2/1/2021 ",0,224.09947734761053,1E-3,99.948819256403098,0,"9/30/2021 ",1.4791998947556289,394.96150056275184,0,"Vol;EDate"]
["A61BE2A680924536827800074","CARSON","EISENHOWER 4-36-25WH","4-36-25WH","WOODFORD","Gas","Mcf","Arps","1","12/1/2020 ",0,105417.92195871123,1E-3,22.9587476352484,0,"11/30/2060 ",3.103471843339793,4830658.3932309132,0,"Vol;EDate"]
["A61BE2A680924536827800074","CARSON","EISENHOWER 4-36-25WH","4-36-25WH","WOODFORD","Oil","bbl","Arps","1","12/1/2020 ",0,136.94763389897344,0.47588124999999998,98.928312266640333,0,"3/31/2025 ",1.0089080576132745,616.56330416981393,0,"Vol;EDate"]
["A61BE2A680924536828200075","CARSON","EISENHOWER 5-36-25WH","5-36-25WH","WOODFORD","Gas","Mcf","Arps","1","12/1/2020 ",0,93568.434422442806,1E-3,15.773180941109654,0,"11/30/2060 ",97.531596663662626,6509519.4269063938,0,"Vol;EDate"]
["A61BE2A680924536828200075","CARSON","EISENHOWER 5-36-25WH","5-36-25WH","WOODFORD","Oil","bbl","Arps","1","9/1/2020 ",0,138.69254443500546,1E-3,80.129078858823675,0,"8/31/2023 ",1.0918127108600364,870.8972021657803,0,"Vol;EDate"]
["A61BE2A680924536830300079","DUSTIN","TRUMAN 3-24-13WH","3-24-13WH","WOODFORD","Gas","Mcf","Arps","1","5/1/2020 ",0,208638.72180751944,1,93.513322071102237,0,"4/30/2060 ",1896.5796470387484,4343061.6646514097,0,"Vol;EDate"]
["A61BE2A680924536830300079","DUSTIN","TRUMAN 3-24-13WH","3-24-13WH","WOODFORD","Oil","bbl","Arps","1","10/1/2020 ",0,156.6578847823981,1E-3,89.412815259268811,0,"11/30/2022 ",1.210536554476302,772.69264464664047,0,"Vol;EDate"]
["A61BE2A680924536830600080","DUSTIN","TRUMAN 5-19-18WH","5-19-18WH","WOODFORD","Gas","Mcf","Arps","1","5/1/2020 ",0,147602.91371301404,0.61181874999999997,72.63677828126842,0,"4/30/2060 ",493.47394496685644,3103635.4475414269,0,"Vol;EDate"]
["A61BE2A680924536830600080","DUSTIN","TRUMAN 5-19-18WH","5-19-18WH","WOODFORD","Oil","bbl","Arps","1","7/1/2020 ",0,117.07280212909184,1E-3,56.002008214631729,0,"2/28/2026 ",1.1185129715043538,1773.2292547131572,0,"Vol;EDate"]
["A61BE2A680924536830700081","DUSTIN","TRUMAN 6-18-19WH","6-18-19WH","WOODFORD","Gas","Mcf","Arps","1","5/1/2020 ",0,182495.56291073855,0.68838124999999994,89.083797012836314,0,"4/30/2060 ",454.56127166522913,2659011.2416859865,0,"Vol;EDate"]
["A61BE2A680924536830700081","DUSTIN","TRUMAN 6-18-19WH","6-18-19WH","WOODFORD","Oil","bbl","Arps","1","3/1/2021 ",0,36.197268767180205,1,10.04123994269176,0,"2/28/2061 ",6.9232930651408848,6913.3325128479937,0,"Vol;EDate"]
["A61BE2A680924536831000082","SCIPIO NORTHWEST","TESLA 5-17-20WH","5-17-20WH","WOODFORD","Gas","Mcf","Arps","1","6/1/2020 ",0,239300.96150616839,1,99.741653414798719,0,"5/31/2060 ",1004.3035850730241,2870354.558836407,0,"Vol;EDate"]
["A61BE2A680924536833200092","DUSTIN","KENNEDY 2-31-30WH","2-31-30WH","WOODFORD","Oil","bbl","Arps","1","11/1/2020 ",0,128.08808056331597,1E-3,66.232572208827364,0,"2/28/2025 ",1.1657149756100438,1222.0049126325341,0,"Vol;EDate"]
["A61BE2A680924536833400093","DUSTIN","KENNEDY 3-31-30WH","3-31-30WH","WOODFORD","Gas","Mcf","Arps","1","10/1/2020 ",0,163969.85094463942,1E-3,75.395366634601814,0,"3/31/2029 ",1.0950897153017847,1343038.5277778329,0,"Vol;EDate"]
["A61BE2A680924536833400093","DUSTIN","KENNEDY 3-31-30WH","3-31-30WH","WOODFORD","Oil","bbl","Arps","1","11/1/2020 ",0,120.84734689351288,1E-3,66.829458083243253,0,"2/28/2025 ",1.0181093640300489,1131.9484549764029,0,"Vol;EDate"]
["A61BE2A680924536833500094","CARSON EAST","RAPUNZEL 1-15-22WH","1-15-22WH","WOODFORD / MAYES","Gas","Mcf","Arps","1","12/1/2020 ",0,196599.88716131932,1E-3,57.987426056825541,0,"11/30/2034 ",1.0505310369346192,2647367.9357794882,0,"Vol;EDate"]
["A61BE2A680924536833500094","CARSON EAST","RAPUNZEL 1-15-22WH","1-15-22WH","WOODFORD / MAYES","Oil","bbl","Arps","1","12/1/2020 ",0,178.35894351246023,1E-3,73.693552904572286,0,"9/30/2024 ",1.0675751409260394,1359.6527057316034,0,"Vol;EDate"]
["A61BE2A680924536833700095","CARSON EAST","RAPUNZEL 2-15-22WH","2-15-22WH","WOODFORD / MAYES","Gas","Mcf","Arps","1","12/1/2020 ",0,202961.16404042431,1E-3,53.450457717939962,0,"9/30/2036 ",1.1207807546409212,3119428.5446705655,0,"Vol;EDate"]
["A61BE2A680924536833700095","CARSON EAST","RAPUNZEL 2-15-22WH","2-15-22WH","WOODFORD / MAYES","Oil","bbl","Arps","1","12/1/2020 ",0,202.92892508191807,1E-3,71.622103365119628,0,"1/31/2025 ",1.0626981698735749,1658.2012061328442,0,"Vol;EDate"]
["A61BE2A680924536814400036","PAPOOSE","THUNDER 1-13-1CH","1-13-1CH","MISSISSIPPIAN","Gas","Mcf","Arps","1","11/1/2018 ",0,58186.102886082204,0.54463125000000012,35.237110761256488,0,"10/31/2058 ",780.76880123292221,3035303.1944652069,0,"Vol;EDate"]
["A61BE2A680924536814400036","PAPOOSE","THUNDER 1-13-1CH","1-13-1CH","MISSISSIPPIAN","Oil","bbl","Arps","1","2/1/2021 ",0,111.57205119947878,1E-3,10,0,"1/31/2061 ",1.6491334283128014,12422.180527744078,0,"Vol;EDate"]
["A61BE2A680924536814700037","CARSON","ROOSEVELT 1-5-18WH","1-5-18WH","WOODFORD","Gas","Mcf","Arps","1","5/1/2019 ",0,78870.447465089586,0.43525625000000001,67.708080214080084,0,"4/30/2059 ",74.895145106547773,1527071.1080426322,0,"Vol;EDate"]
["A61BE2A680924536814700037","CARSON","ROOSEVELT 1-5-18WH","1-5-18WH","WOODFORD","Oil","bbl","Arps","1","2/1/2021 ",0,16.096149809139682,1,10.04123994269176,0,"1/31/2061 ",3.07864007822949,3092.4621005334807,0,"Vol;EDate"]
["A61BE2A680924536815000038","CARSON","ROOSEVELT 2-5-18WH","2-5-18WH","WOODFORD","Gas","Mcf","Arps","1","6/1/2019 ",0,142475.31683667301,0.8555687500000001,86.561746676085278,0,"5/31/2059 ",998.70585767631076,3130380.0969130369,0,"Vol;EDate"]
["A61BE2A680924536815000038","CARSON","ROOSEVELT 2-5-18WH","2-5-18WH","WOODFORD","Oil","bbl","Arps","1","3/1/2021 ",0,202.17348987800668,1E-3,32.904038202958844,0,"4/30/2034 ",1.0567020673649028,5712.0552549604618,0,"Vol;EDate"]
["A61BE2A680924536815200039","CARSON","ROOSEVELT 3-5-18CH","3-5-18CH","CANEY","Gas","Mcf","Arps","1","5/1/2019 ",0,26039.118241092743,1,59.701310888264914,0,"4/30/2059 ",698.93583285279033,1418657.6985300344,0,"Vol;EDate"]
["A61BE2A680924536815200039","CARSON","ROOSEVELT 3-5-18CH","3-5-18CH","CANEY","Oil","bbl","Arps","1","3/1/2021 ",0,7.017657737167573,1,10.04123994269176,0,"2/28/2061 ",1.3422366603890419,1393.9192999860804,0,"Vol;EDate"]
["A61BE2A680924536815800040","CARSON","ROOSEVELT 4-5-18CH","4-5-18CH","CANEY","Gas","Mcf","Arps","1","5/1/2019 ",0,38546.387496795738,1E-3,10.746965256991114,0,"4/30/2059 ",408.2285290035432,4023683.4831920504,0,"Vol;EDate"]
["A61BE2A680924536815800040","CARSON","ROOSEVELT 4-5-18CH","4-5-18CH","CANEY","Oil","bbl","Arps","1","2/1/2021 ",0,30.31447913010625,1E-3,81.919835665089465,0,"11/30/2022 ",1.3278810532577856,182.8113056736093,0,"Vol;EDate"]
["A61BE2A680924536816100041","VERNON NORTHWEST","SCHRUTE FARMS 1-16-4CH","1-16-4CH","MISSISSIPPIAN","Gas","Mcf","Arps","1","2/1/2021 ",0,31495.322958159177,1,98.887482098450391,0,"1/31/2061 ",174.79590589617027,467434.83895037783,0,"Vol;EDate"]
["A61BE2A680924536816100041","VERNON NORTHWEST","SCHRUTE FARMS 1-16-4CH","1-16-4CH","MISSISSIPPIAN","Oil","bbl","Arps","1","11/1/2020 ",0,18.172635328723018,1E-3,25.658296612548437,0,"6/30/2030 ",1.0358155899767172,655.37216484847625,0,"Vol;EDate"]
["A61BE2A680924536816700042","VERNON NORTHWEST","SCHRUTE FARMS 1-17-5CH","1-17-5CH","MISSISSIPPIAN","Gas","Mcf","Arps","1","7/1/2019 ",0,43716.744235520659,1,59.312891986357606,0,"6/30/2059 ",1185.600968711213,2139311.0405091769,0,"Vol;EDate"]
["A61BE2A680924536816700042","VERNON NORTHWEST","SCHRUTE FARMS 1-17-5CH","1-17-5CH","MISSISSIPPIAN","Oil","bbl","Arps","1","12/1/2020 ",0,23.605051018157681,1E-3,82.956153777369096,0,"7/31/2022 ",1.2412583372787831,143.91371995160745,0,"Vol;EDate"]
["A61BE2A680924536817000043","VERNON NORTHWEST","SCHRUTE FARMS 1-16-28CH","1-16-28CH","MISSISSIPPIAN","Gas","Mcf","Arps","1","1/1/2019 ",0,110568.66382795412,1,67.745298730177694,0,"12/31/2058 ",2396.9739161900707,4556762.5631119087,0,"Vol;EDate"]
["A61BE2A680924536817000043","VERNON NORTHWEST","SCHRUTE FARMS 1-16-28CH","1-16-28CH","MISSISSIPPIAN","Oil","bbl","Arps","1","3/1/2021 ",0,19.157756722371762,1,10.04123994269176,0,"2/28/2061 ",3.6642202237068102,3704.2876241734562,0,"Vol;EDate"]
["A61BE2A680924536817300044","VERNON NORTHWEST","SCHRUTE FARMS 1-17-29CH","1-17-29CH","MISSISSIPPIAN","Gas","Mcf","Arps","1","7/1/2019 ",0,63897.744252081589,1,82.112125614254623,0,"6/30/2059 ",917.87684382926034,2225307.3159723538,0,"Vol;EDate"]
["A61BE2A680924536817300044","VERNON NORTHWEST","SCHRUTE FARMS 1-17-29CH","1-17-29CH","MISSISSIPPIAN","Oil","bbl","Arps","1","3/1/2021 ",0,18.086019722500275,0.69306875000000001,10.028517481196019,0,"2/28/2061 ",2.5105655878623541,3080.2649807279854,0,"Vol;EDate"]
["A61BE2A680924536817700045","PAPOOSE","MAVERICK 1-10-3CH","1-10-3CH","MISSISSIPPIAN","Gas","Mcf","Arps","1","2/1/2021 ",0,22294.870121351647,1,99.819136206741049,0,"1/31/2061 ",88.310655358934326,253609.2116761347,0,"Vol;EDate"]
["A61BE2A680924536817700045","PAPOOSE","MAVERICK 1-10-3CH","1-10-3CH","MISSISSIPPIAN","Oil","bbl","Arps","1","2/1/2021 ",0,12.34009737648676,1,10.04123994269176,0,"1/31/2061 ",2.3602363796921741,2626.1025812032767,0,"Vol;EDate"]
["A61BE2A680924536817900046","FUHRMAN","MAVERICK 1-14-23CH","1-14-23CH","MISSISSIPPIAN","Gas","Mcf","Arps","1","2/1/2021 ",0,14527.899961326937,1,46.1802100162122,0,"1/31/2061 ",564.79843645608264,911448.49650933349,0,"Vol;EDate"]
["A61BE2A680924536817900046","FUHRMAN","MAVERICK 1-14-23CH","1-14-23CH","MISSISSIPPIAN","Oil","bbl","Arps","1","11/1/2020 ",0,11.729876427736194,1E-3,22.268680407292852,0,"6/30/2030 ",1.0285987894815209,648.86639764799452,0,"Vol;EDate"]
["A61BE2A680924536818100047","FUHRMAN","MAVERICK 1-15-22CH","1-15-22CH","MISSISSIPPIAN","Gas","Mcf","Arps","1","2/1/2019 ",0,42149.171840144198,0.93681875000000003,63.127856889981501,0,"1/31/2059 ",858.54447414109586,1752069.4647458792,0,"Vol;EDate"]
["A61BE2A680924536818100047","FUHRMAN","MAVERICK 1-15-22CH","1-15-22CH","MISSISSIPPIAN","Oil","bbl","Arps","1","11/1/2020 ",0,15.272908888523485,1E-3,57.611114671037257,0,"12/31/2023 ",1.009696644724114,332.30929386560712,0,"Vol;EDate"]
["A61BE2A680924536818300048","PAPOOSE","MAVERICK 1-11-2CH","1-11-2CH","MISSISSIPPIAN","Gas","Mcf","Arps","1","2/1/2021 ",0,19193.212907986326,1E-3,54.236134707169839,0,"7/31/2033 ",1.0994911807843304,288572.47124030266,0,"Vol;EDate"]
["A61BE2A680924536818300048","PAPOOSE","MAVERICK 1-11-2CH","1-11-2CH","MISSISSIPPIAN","Oil","bbl","Arps","1","11/1/2020 ",0,16.968265055301842,1E-3,55.127757252164876,0,"4/30/2024 ",1.0300772659781225,213.17077622348785,0,"Vol;EDate"]
["A61BE2A680924536818600049","SCIPIO NORTHWEST","OSCAR LU 1-17-20WH","1-17-20WH","WOODFORD","Gas","Mcf","Arps","1","7/1/2020 ",0,42241.425137626087,1E-3,10,0,"6/30/2060 ",624.36556023769947,4758551.7719211048,0,"Vol;EDate"]
["A61BE2A680924536818600049","SCIPIO NORTHWEST","OSCAR LU 1-17-20WH","1-17-20WH","WOODFORD","Oil","bbl","Arps","1","1/1/2021 ",0,10.899235851715398,1E-3,31.902663472431136,0,"2/28/2027 ",1.0219983945564917,298.43243600632366,0,"Vol;EDate"]
["A61BE2A680924536820200050","SCIPIO NORTHWEST","OSCAR LU 1-18-19WH","1-18-19WH","WOODFORD","Gas","Mcf","Arps","1","3/1/2020 ",0,50885.494986094367,1E-3,8.3270701969267442,0,"2/29/2060 ",1571.2252738220689,6807975.1127345944,0,"Vol;EDate"]
["A61BE2A680924536820200050","SCIPIO NORTHWEST","OSCAR LU 1-18-19WH","1-18-19WH","WOODFORD","Oil","bbl","Arps","1","2/1/2021 ",0,16.475529088092863,1E-3,78.670546923619071,0,"9/30/2022 ",1.2638259096983788,106.68816744377989,0,"Vol;EDate"]
["A61BE2A680924536821400051","BEARDEN NORTH","CHEATWOOD 1-16-9CH","1-16-9CH","MISSISSIPPIAN","Gas","Mcf","Arps","1","8/1/2019 ",0,40022.354117918869,1,29.244138622814862,0,"7/31/2059 ",2702.158427802513,3773077.6361080455,0,"Vol;EDate"]
["A61BE2A680924536821400051","BEARDEN NORTH","CHEATWOOD 1-16-9CH","1-16-9CH","MISSISSIPPIAN","Oil","bbl","Arps","1","2/1/2021 ",0,51.731463770843874,1E-3,99.993438294721741,0,"5/31/2021 ",2.1850867285951669,84,0,"Vol;EDate"]
["A61BE2A680924536821600052","PAPOOSE NORTH","CHEATWOOD 1-15-27CH","1-15-27CH","MISSISSIPPIAN","Gas","Mcf","Arps","1","8/1/2019 ",0,45754.541924354373,0.82900624999999994,39.132501278188514,0,"7/31/2059 ",1452.4748959655617,2911259.0946500134,0,"Vol;EDate"]
["A61BE2A680924536822600056","GREGORY","SCRANTON 1-19-31WH","1-19-31WH","MISSISSIPPIAN","Gas","Mcf","Arps","1","10/1/2019 ",0,62555.363852601949,1,48.164467341292003,0,"9/30/2059 ",2298.1419308007899,3929677.8421477126,0,"Vol;EDate"]
["A61BE2A680924536822600056","GREGORY","SCRANTON 1-19-31WH","1-19-31WH","MISSISSIPPIAN","Oil","bbl","Arps","1","11/1/2020 ",0,57.372804325147435,0.26806875000000008,74.330659463660893,0,"2/28/2026 ",1.0241650535110636,595.92509285508561,0,"Vol;EDate"]
["A61BE2A680924536822900057","WELEETKA DISTRICT EAST","SCRANTON 1-19-7CH","1-19-7CH","MISSISSIPPIAN","Gas","Mcf","Arps","1","10/1/2019 ",0,25294.079159827859,1,59.507530250321558,0,"9/30/2059 ",682.43988498919043,1269693.4355460694,0,"Vol;EDate"]
["A61BE2A680924536822900057","WELEETKA DISTRICT EAST","SCRANTON 1-19-7CH","1-19-7CH","MISSISSIPPIAN","Oil","bbl","Arps","1","11/1/2020 ",0,17.383133017518226,1E-3,62.752446580768883,0,"8/31/2023 ",1.0615305640921548,176.06384113389493,0,"Vol;EDate"]
["A61BE2A680924536823200058","VERNON NORTHWEST","DUNDER 1-18-6CH","1-18-6CH","MISSISSIPPIAN","Gas","Mcf","Arps","1","5/1/2019 ",0,75048.573824450403,1,95.975181578108945,0,"4/30/2059 ",581.73745184466202,1600451.8988618618,0,"Vol;EDate"]
["A61BE2A680924536823200058","VERNON NORTHWEST","DUNDER 1-18-6CH","1-18-6CH","MISSISSIPPIAN","Oil","bbl","Arps","1","11/1/2020 ",0,26.677734935182205,1E-3,54.068951956328746,0,"12/31/2024 ",1.0426609980037163,352.94686337215876,0,"Vol;EDate"]
["A61BE2A680924536823500059","VERNON NORTHWEST","DUNDER 1-18-30CH","1-18-30CH","MISSISSIPPIAN","Gas","Mcf","Arps","1","5/1/2019 ",0,92053.899783375382,1,97.333615261507632,0,"4/30/2059 ",633.12087040661743,1783970.0128326099,0,"Vol;EDate"]
["A61BE2A680924536823500059","VERNON NORTHWEST","DUNDER 1-18-30CH","1-18-30CH","MISSISSIPPIAN","Oil","bbl","Arps","1","11/1/2020 ",0,34.790830231504259,1E-3,54.273285101195668,0,"4/30/2025 ",1.0321473631522735,462.453136869189,0,"Vol;EDate"]
["A61BE2A680924536823900060","SCIPIO NORTHWEST","TWAIN 1-9-4WH","1-9-4WH","WOODFORD","Gas","Mcf","Arps","1","8/1/2020 ",0,9478.2272080542079,1E-3,60.353331694559763,0,"5/31/2030 ",1.0627892940352714,76770.382894107635,0,"Vol;EDate"]
["A61BE2A680924536823900060","SCIPIO NORTHWEST","TWAIN 1-9-4WH","1-9-4WH","WOODFORD","Oil","bbl","Arps","1","3/1/2020 ",0,1.3459379441614898,1E-3,22.614483206565637,0,"2/28/2021 ",1.041743818886208,139,0,"Vol;EDate"]
["A61BE2A680924536824100061","SCIPIO NORTHWEST","TWAIN 2-9-4CH","2-9-4CH","CANEY","Gas","Mcf","Arps","1","12/1/2019 ",0,54854.738132445258,0.65713124999999994,49.975085015867158,0,"11/30/2059 ",611.09382703715096,2214676.4831472207,0,"Vol;EDate"]
["A61BE2A680924536824100061","SCIPIO NORTHWEST","TWAIN 2-9-4CH","2-9-4CH","CANEY","Oil","bbl","Arps","1","2/1/2021 ",0,5.0139224678225993,1,10.04123994269176,0,"11/30/2058 ",1.0029929560363497,914.66122490708608,0,"Vol;EDate"]
["A61BE2A680924536824300062","SCIPIO NORTHWEST","TWAIN 1-10-3WH","1-10-3WH","WOODFORD","Gas","Mcf","Arps","1","4/1/2021 ",0,25835.179038207199,1E-3,69.245032576385327,0,"9/30/2029 ",1.1454220193693831,251677.43876521135,0,"Vol;EDate"]
["A61BE2A680924536824300062","SCIPIO NORTHWEST","TWAIN 1-10-3WH","1-10-3WH","WOODFORD","Oil","bbl","Arps","1","2/1/2021 ",0,2.7926492356437165,1E-3,10,0,"9/30/2030 ",1.0090512317209204,226.96157059201164,0,"Vol;EDate"]
["A61BE2A680924536824500063","SCIPIO NORTHWEST","MOSE 1-6-7WH","1-6-7WH","WOODFORD / MAYES","Gas","Mcf","Arps","1","1/1/2020 ",0,32447.577085997305,1,67.587443090293121,0,"12/31/2059 ",706.39715838430618,1359192.4686304517,0,"Vol;EDate"]
["A61BE2A680924536824500063","SCIPIO NORTHWEST","MOSE 1-6-7WH","1-6-7WH","WOODFORD / MAYES","Oil","bbl","Arps","1","12/1/2020 ",0,9.466100253707749,1E-3,89.329163633383615,0,"11/30/2021 ",1.0116603331677827,47.426371919449352,0,"Vol;EDate"]
["A61BE2A680924536824800064","SCIPIO NORTHWEST","MOSE 1-5-8WH","1-5-8WH","WOODFORD / MAYES","Gas","Mcf","Arps","1","1/1/2020 ",0,67590.560500375708,1,51.93257567610565,0,"12/31/2059 ",2235.9728984434701,3818488.1449971357,0,"Vol;EDate"]
["A61BE2A680924536824800064","SCIPIO NORTHWEST","MOSE 1-5-8WH","1-5-8WH","WOODFORD / MAYES","Oil","bbl","Arps","1","11/1/2020 ",0,18.842681803421385,1E-3,69.523727035782528,0,"2/28/2023 ",1.18640396201547,157.31125985482058,0,"Vol;EDate"]
["A61BE2A680924536825100065","HANNA NORTHWEST","MIFFLIN 1-14-26CH","1-14-26CH","MISSISSIPPIAN","Gas","Mcf","Arps","1","3/1/2020 ",0,57515.982344662938,1,68.214625247115279,0,"2/29/2060 ",1231.2761989103331,2410083.0251887646,0,"Vol;EDate"]
["A61BE2A680924536825100065","HANNA NORTHWEST","MIFFLIN 1-14-26CH","1-14-26CH","MISSISSIPPIAN","Oil","bbl","Arps","1","9/1/2020 ",0,15.187949056078587,1E-3,34.965783885530044,0,"10/31/2026 ",1.0700385447466618,360.96919884135485,0,"Vol;EDate"]
["A61BE2A680924536829500076","CARSON","HAMILTON 4-14-2WH","4-14-2WH","SYLVAN","Gas","Mcf","Arps","1","4/1/2020 ",0,337073.57212537463,1,99.971414591696856,0,"3/31/2060 ",1034.4862755176744,3233009.4670999637,0,"Vol;EDate"]
["A61BE2A680924536829500076","CARSON","HAMILTON 4-14-2WH","4-14-2WH","SYLVAN","Oil","bbl","Arps","1","12/1/2020 ",0,64.155446648806262,1E-3,18.068219294191845,0,"9/30/2041 ",1.0098276644925157,3659.6762314506445,0,"Vol;EDate"]
["A61BE2A680924536829800077","CARSON","HAMILTON 3-14-2WH","3-14-2WH","WOODFORD / MAYES","Gas","Mcf","Arps","1","4/1/2020 ",0,311539.04955432203,1,99.836241540503394,0,"3/31/2060 ",1214.9955170878784,3520951.3812405355,0,"Vol;EDate"]
["A61BE2A680924536829800077","CARSON","HAMILTON 3-14-2WH","3-14-2WH","WOODFORD / MAYES","Oil","bbl","Arps","1","2/1/2021 ",0,58.058037055175539,1E-3,79.250060798448175,0,"7/31/2023 ",1.1491533034755526,397.45061682736355,0,"Vol;EDate"]
["A61BE2A680924536830000078","CARSON","HAMILTON 2-14-2WH","2-14-2WH","WOODFORD","Gas","Mcf","Arps","1","4/1/2020 ",0,169711.70226719751,1E-3,50.008396492511054,0,"7/31/2037 ",1.0246942231338736,2851375.2678211741,0,"Vol;EDate"]
["A61BE2A680924536830000078","CARSON","HAMILTON 2-14-2WH","2-14-2WH","WOODFORD","Oil","bbl","Arps","1","2/1/2021 ",0,62.519617183094248,1E-3,88.40990133164631,0,"11/30/2022 ",1.2143389847486339,310.89942960748311,0,"Vol;EDate"]
["A61BE2A680924536831000082","SCIPIO NORTHWEST","TESLA 5-17-20WH","5-17-20WH","WOODFORD","Oil","bbl","Arps","1","2/1/2021 ",0,51.279611451037745,1E-3,87.46088683876728,0,"11/30/2022 ",1.1502150613107591,236.27224999935424,0,"Vol;EDate"]
["A61BE2A680924536831200083","SCIPIO NORTHWEST","TESLA 4-17-20WH","4-17-20WH","WOODFORD","Gas","Mcf","Arps","1","6/1/2020 ",0,291105.47245022276,1,99.849686988577233,0,"5/31/2060 ",1120.4137623759589,3043344.9481225535,0,"Vol;EDate"]
["A61BE2A680924536831200083","SCIPIO NORTHWEST","TESLA 4-17-20WH","4-17-20WH","WOODFORD","Oil","bbl","Arps","1","9/1/2020 ",0,16.589846708573592,1E-3,38.628135512901537,0,"4/30/2026 ",1.0455650591442016,349.22814195547824,0,"Vol;EDate"]
["A61BE2A680924536831300084","SCIPIO NORTHWEST","TESLA 3-17-20WH","3-17-20WH","WOODFORD","Gas","Mcf","Arps","1","6/1/2020 ",0,233255.93842537614,1,98.358388059823369,0,"5/31/2060 ",1416.2367294451635,3561456.8086454724,0,"Vol;EDate"]
["A61BE2A680924536831300084","SCIPIO NORTHWEST","TESLA 3-17-20WH","3-17-20WH","WOODFORD","Oil","bbl","Arps","1","11/1/2020 ",0,26.836563392253826,1E-3,74.501905632070972,0,"2/28/2023 ",1.1157518102420336,199.05823361375531,0,"Vol;EDate"]
["A61BE2A680924536831700085","CARSON","HAMILTON 4-14-26WH","4-14-26WH","WOODFORD / MAYES","Gas","Mcf","Arps","1","9/1/2020 ",0,85599.468422835853,1E-3,31.902663472431136,0,"2/28/2050 ",1.024864383093161,2797250.7045743521,0,"Vol;EDate"]
["A61BE2A680924536831700085","CARSON","HAMILTON 4-14-26WH","4-14-26WH","WOODFORD / MAYES","Oil","bbl","Arps","1","12/1/2020 ",0,59.871620062358538,1E-3,28.045839959904782,0,"3/31/2033 ",1.0340401270850614,2029.857752621544,0,"Vol;EDate"]
["A61BE2A680924536832100086","CARSON","HAMILTON 3-14-26WH","3-14-26WH","WOODFORD / MAYES","Gas","Mcf","Arps","1","7/1/2020 ",0,346673.38145938097,1,99.998916901289817,0,"6/30/2060 ",760.28029994249425,2560512.3537833309,0,"Vol;EDate"]
["A61BE2A680924536832100086","CARSON","HAMILTON 3-14-26WH","3-14-26WH","WOODFORD / MAYES","Oil","bbl","Arps","1","2/1/2021 ",0,64.314725704077503,1E-3,92.96853028060228,0,"7/31/2022 ",1.2156211357911897,272.50915057198944,0,"Vol;EDate"]
["A61BE2A680924536832300087","CARSON","HAMILTON 2-14-26WH","2-14-26WH","WOODFORD","Gas","Mcf","Arps","1","7/1/2020 ",0,237726.51596611296,1,97.700267503741742,0,"6/30/2060 ",1571.3844444615909,3879468.4553966927,0,"Vol;EDate"]
["A61BE2A680924536832300087","CARSON","HAMILTON 2-14-26WH","2-14-26WH","WOODFORD","Oil","bbl","Arps","1","2/1/2021 ",0,6.361241794018281,1E-3,96.312154955316416,0,"7/31/2021 ",1.2396659574304463,62,0,"Vol;EDate"]
["A61BE2A680924536832400088","CARSON EAST","FRANKLIN 2-12-24WH","2-12-24WH","WOODFORD","Gas","Mcf","Arps","1","10/1/2020 ",0,173884.73009771109,1E-3,61.91275864537765,0,"3/31/2033 ",1.0016656310014826,2107882.3916119952,0,"Vol;EDate"]
["A61BE2A680924536832400088","CARSON EAST","FRANKLIN 2-12-24WH","2-12-24WH","WOODFORD","Oil","bbl","Arps","1","2/1/2021 ",0,84.317457711155541,1E-3,99.999878152816649,0,"3/31/2021 ",9.3450230289863097,98,0,"Vol;EDate"]
["A61BE2A680924536832600089","CARSON EAST","FRANKLIN 3-12-24WH","3-12-24WH","WOODFORD","Gas","Mcf","Arps","1","11/1/2020 ",0,202940.96251394021,1,96.513543187352269,0,"10/31/2060 ",1506.3525330652267,3690411.2346314793,0,"Vol;EDate"]
["A61BE2A680924536832600089","CARSON EAST","FRANKLIN 3-12-24WH","3-12-24WH","WOODFORD","Oil","bbl","Arps","1","2/1/2021 ",0,62.659183493075531,1E-3,10,0,"3/31/2060 ",1.0116258689671642,6919.2778614971494,0,"Vol;EDate"]
["A61BE2A680924536832900090","CARSON EAST","FRANKLIN 4-12-24WH","4-12-24WH","WOODFORD","Gas","Mcf","Arps","1","12/1/2020 ",0,40877.923351937054,1E-3,22.614483206565637,0,"11/30/2060 ",1.4383888709544546,1889230.5619884583,0,"Vol;EDate"]
["A61BE2A680924536832900090","CARSON EAST","FRANKLIN 4-12-24WH","4-12-24WH","WOODFORD","Oil","bbl","Arps","1","12/1/2020 ",0,27.858698327045513,1E-3,60.880108859620663,0,"5/31/2024 ",1.0441695760998311,300.42060207998088,0,"Vol;EDate"]
["A61BE2A680924536833100091","DUSTIN","KENNEDY 1-31-30WH","1-31-30WH","WOODFORD","Gas","Mcf","Arps","1","10/1/2020 ",0,208496.80842392103,0.66338124999999992,82.180494655873048,0,"9/30/2060 ",633.49339414521614,3623387.7288091029,0,"Vol;EDate"]
["A61BE2A680924536833100091","DUSTIN","KENNEDY 1-31-30WH","1-31-30WH","WOODFORD","Oil","bbl","Arps","1","10/1/2020 ",0,148.74825398802966,1E-3,65.930113531484977,0,"3/31/2025 ",1.1719798702377067,1371.4962906078808,0,"Vol;EDate"]
["A61BE2A680924536833200092","DUSTIN","KENNEDY 2-31-30WH","2-31-30WH","WOODFORD","Gas","Mcf","Arps","1","10/1/2020 ",0,188190.88280815256,0.59463125000000006,83.452913457821381,0,"9/30/2060 ",326.81044329025264,2797303.2925721277,0,"Vol;EDate"]
["A61BE2A680924536833900096","CARSON EAST","RAPUNZEL 3-15-22WH","3-15-22WH","WOODFORD","Gas","Mcf","Arps","1","12/1/2020 ",0,159496.16841844312,1E-3,44.113630368158162,0,"5/31/2041 ",1.0542742031049648,3260391.5019404162,0,"Vol;EDate"]