{"text_format":"1","workbook":"xlsx","n_sheets":6,"sheets":["Start Here","Bottom Line","ConnectOneLiner","InvOneLiner","PriceQC","Projections"],"not_rendered":{"charts":0,"images":3,"macros":1,"external_links":0,"defined_names":4,"comments":0,"pivot_tables":0},"unopened":[],"bounds":{"document_bytes":16777216,"sheet_cells":100000,"rows_first":2000,"rows_last":500,"rows_between":2000,"halvings":0,"cell_chars":16384,"cell_head_chars":4096},"cells_cut":0,"cells_raw":0,"read":"whole","date_system":"1900"}

{"sheet":"Start Here","index":0,"n_rows":20,"n_cols":2,"rows_kept":20,"cut":false,"hidden":false,"merged":[[12,1,12,17],[11,1,11,17],[0,7,5,8],[0,0,0,5],[9,1,9,13],[10,1,10,17],[8,1,8,4]]}
["Welcome to V2Connect!"]
[]
[]
[]
[]
[]
[]
[]
[null,"To use this workbook  "]
[null,"1. Open a Project in 2.11 and run an \"V2Connect\" report (under Miscellaneous category) for All Cases for your selected Partner "]
{"$rows_left_out":11}
{"sheet":"Bottom Line","index":1,"n_rows":39,"n_cols":9,"rows_kept":39,"cut":false,"hidden":false,"merged":[[0,0,0,9],[2,6,2,8],[10,1,10,3],[2,1,2,3],[25,1,25,3]]}
[{"$f":"'ConnectOneLiner'!D96","v":"TxWells"}]
[]
[null,"Volumes",null,null,null,null,"Maximum Asset Information"]
[null,"Total Gross Oil",{"$f":"SUM('ConnectOneLiner'!X:X)","v":42.874519983641328},{"$f":"'ConnectOneLiner'!AE96","v":"Mbbl"},null,null,{"$f":"\"Max Net Revenue \"&D12","v":"Max Net Revenue M$"},{"$f":"MAX('ConnectOneLiner'!AN:AN)","v":19038.643384428178},{"$f":"INDEX('ConnectOneLiner'!A:A,MATCH(MAX('ConnectOneLiner'!AN:AN),'ConnectOneLiner'!AN:AN,0))","v":"OSCAR LU 1-18-19WH"}]
[null,"Total Gross Gas",{"$f":"SUM('ConnectOneLiner'!Y:Y)","v":102973.35407999081},{"$f":"'ConnectOneLiner'!AF96","v":"MMcf"},null,null,{"$f":"\"Max Net Expenses \"&D12","v":"Max Net Expenses M$"},{"$f":"MAX('ConnectOneLiner'!AU:AU)","v":8369.8606501512731},{"$f":"INDEX('ConnectOneLiner'!A:A,MATCH(MAX('ConnectOneLiner'!AU:AU),'ConnectOneLiner'!AU:AU,0))","v":"OSCAR LU 1-18-19WH"}]
[null,"Total Gross NGL",{"$f":"SUM('ConnectOneLiner'!Z:Z)","v":0},{"$f":"'ConnectOneLiner'!AG96","v":"bbl"},null,null,"Max Gradient",{"$f":"MAX('ConnectOneLiner'!Q:Q)","v":0},{"$f":"INDEX('ConnectOneLiner'!A:A,MATCH(MAX('ConnectOneLiner'!Q:Q),'ConnectOneLiner'!Q:Q,0))","v":"KLIMEK 10-2H"}]
[null,"Total Net Oil",{"$f":"SUM('ConnectOneLiner'!AB:AB)","v":32.155889987730987},{"$f":"'ConnectOneLiner'!AE96","v":"Mbbl"},null,null,"Max B Factor",{"$f":"MAX(Projections!M:M)","v":1},{"$f":"INDEX(Projections!C:C,MATCH(MAX(Projections!M:M),Projections!M:M,0))","v":"FIELDS 19-1HX"}]
[null,"Total Net Gas",{"$f":"SUM('ConnectOneLiner'!AC:AC)","v":77230.015559993102},{"$f":"'ConnectOneLiner'!AF96","v":"MMcf"},null,null,"Last ECL After Date",{"$f":"MAX('ConnectOneLiner'!BH:BH)","v":"00:00:00"},{"$f":"INDEX('ConnectOneLiner'!A:A,MATCH(MAX('ConnectOneLiner'!BH:BH),'ConnectOneLiner'!BH:BH,0))","v":{"$error":"#N/A"}}]
[null,"Total Net NGL",{"$f":"SUM('ConnectOneLiner'!AD:AD)","v":0},{"$f":"'ConnectOneLiner'!AG96","v":"bbl"},null,null,{"$f":"\"Max Oil Price \"&D31","v":{"$error":"#REF!"}},{"$f":"MAX('ConnectOneLiner'!AH:AH)","v":85.05},{"$f":"INDEX('ConnectOneLiner'!A:A,MATCH(MAX('ConnectOneLiner'!AH:AH),'ConnectOneLiner'!AH:AH,0))","v":"CARVER 1-8-5WH"}]
[null,null,null,null,null,null,{"$f":"\"Max Gas Price \"&D32","v":{"$error":"#REF!"}},{"$f":"MAX('ConnectOneLiner'!AI:AI)","v":5.7290000000000001},{"$f":"INDEX('ConnectOneLiner'!A:A,MATCH(MAX('ConnectOneLiner'!AI:AI),'ConnectOneLiner'!AI:AI,0))","v":"SCRANTON 1-19-31WH"}]
{"$rows_left_out":30}
{"sheet":"ConnectOneLiner","index":2,"n_rows":96,"n_cols":85,"rows_kept":96,"cut":false,"hidden":false,"merged":[]}
["CaseName","UniqueId","Archive","Project","Partner","ReserveClass","ReserveCategory","Field","Reservoir","County","State","OperatorName","PHDWinID","API_Code","Latitude","Longitude","Gradient","TotalDepth","Location","LowerPerf","UpperPerf","CaseType","MajorPhase","GrossOil","GrossGas","GrossNGL","Shrinkage","NetOil","NetGas","NetNGL","OilUnits","GasUnits","NGLUnits","OilPrice","GasPrice","NGLPrice","CoNetRevOil","CoNetRevGas","CoNetRevNGL","AllNetRevenue","OpCost","TransCost","OtherCost","VariableExpense","WellCost","FixedCost","AllNetExpense","NetLocalTax","NetProdTax","NetTanInv","NetInTanInv","NetAbandon","NetInv","NetProfit","NDCash","DiscCash","DiscFactor","RevenueUnits","CaseLife","ECLAfterDate","ECLAfterLink","AsofDate","ECLDate","FirstReversionDate","SecondReversionDate","ROI","DiscROI","DiscPayout","Is_Eco","InitRIOil","InitRIGas","FirstOfWellCnt","LastOfWellCnt","CaseMultiplier","VolumeMultiplier","IDCaseName","IDPHDWinID","API Formatted","API Number","Field Code","Operator Code","PhdWin ID","Retrieval Code","RRC Dist Code","Unique ID"]
["KLIMEK 10-2H","A61BE2A680924536797500002","default","TxWells","All Cases","Proved","Producing","TIGER FLATS SOUTHEAST","MISSISSIPPIAN","OKMULGEE","OK","CALYX ENERGY III LLC",2,"35111274820000",35.522089999999999,-96.019840000000002,0,"7313","N  12.0/E  12.0/SEC  10.0  SW SE SE","6905","3015","Standard Case","Gas",0,0,0,0,0,0,0,"Mbbl","MMcf","bbl",0,0,0,0,0,0,0,0,0,0,0,0,0,0,0,0,0,50,50,50,0,-50,-50,10,"M$",0,null,"Seg1","2022-10-01","2022-10-01",null,null,0,0,0,"False",0.75,0.75,"0","0",0,1,"KLIMEK 10-2H",2,"35-111-27482-0000","35111274820000","049783","269133","00002","23500112157",null,"A61BE2A680924536797500002"]
["CHEATWOOD 15-1HX","A61BE2A680924536797800003","default","TxWells","All Cases","Proved","Producing","BEARDEN EAST","MISSISSIPPIAN","OKFUSKEE","OK","CALYX ENERGY III LLC",3,"35107235710100",35.335889999999999,-96.351939999999999,0,"10146","N  10.0/E  9.0/SEC  15.0  NW SW SW","0","0","Standard Case","Gas",0,327.64292233216651,0,0,0,245.73219174912481,0,"Mbbl","MMcf","bbl",0,4.6260000000000003,0,0,1136.7052919172236,0,1136.7052919172233,0,368.59828762368727,0,368.59828762368716,229.32141067761808,110.85935112936345,708.77904943066869,0,80.649240461527,0,50,50,50,0,297.27700202502774,270.90596546022527,10,"M$",4.4982888432580417,null,"Seg1","2022-10-01","2027-03-31",null,null,6.9455400405005516,9.4777158742833638,0.18617385352498281,"True",0.75,0.75,"1","1",0,1,"CHEATWOOD 15-1HX",3,"35-107-23571-0100","35107235710100","003136","269133","00003","23500112494",null,"A61BE2A680924536797800003"]
["FIELDS 19-1HX","A61BE2A680924536798100004","default","TxWells","All Cases","Proved","Producing","GREASY CREEK","MISSISSIPPIAN","HUGHES","OK","CALYX ENERGY III LLC",4,"35063245930000",35.230919999999998,-96.190690000000004,0,"12258","N  9.0/E  11.0/SEC  30.0  SWNENWNW","12149","3835","Standard Case","Gas",0.24173044467282717,898.57658471565196,0,0,0.18129783350462039,673.93243853673914,0,"Mbbl","MMcf","bbl",63.896999999999998,4.7089999999999996,0,11.584422143367792,3173.8188220599168,0,3185.4032442032849,0.72519133401848135,1010.8986578051085,0,1011.6238491391271,804.86327687620076,389.08979479366769,2205.5769208089955,0,226.004360176223,0,50,50,50,0,703.82196321806612,542.86364350986253,10,"M$",15.778234086242289,null,"Seg1","2022-10-01","2038-07-11",null,null,15.076439264361328,53.239972407978776,4.6543463381245723E-2,"True",0.75,0.75,"1","1",0,1,"FIELDS 19-1HX",4,"35-063-24593-0000","35063245930000","020345","269133","00004","23500112800",null,"A61BE2A680924536798100004"]
["MEADORS 25-1H","A61BE2A680924536798300005","default","TxWells","All Cases","Proved","Producing","GREASY CREEK","MISSISSIPPIAN","HUGHES","OK","CALYX ENERGY III LLC",5,"35063246190000",35.215910000000001,-96.205070000000006,0,"8759","N  9.0/E  10.0/SEC  36.0  SENWNENW","0","0","Standard Case","Gas",1.5455621835978459E-2,17.545465535550242,0,0,1.1591716376983844E-2,13.159099151662684,0,"Mbbl","MMcf","bbl",83.893000000000001,5.2910000000000004,0,0.97246153562227455,69.62857977936703,0,70.601041314989331,4.6366865507935381E-2,19.738648727494027,0,19.785015593001965,25.17741067761807,12.171351129363449,57.133777399983487,0,5.0091438812984928,0,50,50,50,0,-41.541879966292662,-39.329315356730554,10,"M$",0.4982888432580424,null,"Seg1","2022-10-01","2023-03-31",null,null,0.16916240067414692,0.17362206951524872,0,"True",0.75,0.75,"1","1",0,1,"MEADORS 25-1H",5,"35-063-24619-0000","35063246190000","020345","269133","00005","23500112876",null,"A61BE2A680924536798300005"]
["MEADORS 25-2H","A61BE2A680924536798600006","default","TxWells","All Cases","Proved","Producing","GREASY CREEK","MISSISSIPPIAN","HUGHES","OK","CALYX ENERGY III LLC",6,"35063246210000",35.215870000000002,-96.205209999999994,0,"8862","N  9.0/E  10.0/SEC  36.0  SENWNENW","0","0","Standard Case","Gas",0.16166555207591707,252.23234385548454,0,0,0.12124916405693782,189.17425789161342,0,"Mbbl","MMcf","bbl",72.896000000000001,4.601,0,8.8385429691198585,870.41971382805457,0,879.25825679717445,0.48499665622775123,283.7613868374201,0,284.24638349364784,229.32141067761808,110.85935112936345,624.42714530062938,0,62.383373319759528,0,50,50,50,0,142.44773817678555,135.17565553328805,10,"M$",4.4982888432580417,null,"Seg1","2022-10-01","2027-03-31",null,null,3.8489547635357115,5.2301792756183145,0.31485284052019158,"True",0.75,0.75,"1","1",0,1,"MEADORS 25-2H",6,"35-063-24621-0000","35063246210000","020345","269133","00006","23500112877",null,"A61BE2A680924536798600006"]
["MEADORS 36-1HX","A61BE2A680924536799100007","default","TxWells","All Cases","Proved","Producing","GREASY CREEK","MISSISSIPPIAN","HUGHES","OK","CALYX ENERGY III LLC",7,"35063246200000",35.215910000000001,-96.205020000000005,0,"11818","N  9.0/E  10.0/SEC  36.0  SENWNENW","11716","3920","Standard Case","Gas",4.7929751527837669E-2,21.449501810564442,0,0,3.5947313645878255E-2,16.087126357923331,0,"Mbbl","MMcf","bbl",83.903999999999996,5.2809999999999997,0,3.0161218712438886,84.961719112356604,0,87.977840983600501,0.14378925458351302,24.130689536884997,0,24.274478791468518,25.17741067761807,12.171351129363449,61.623240598450039,0,6.2420278177864548,0,50,50,50,0,-29.887427432635995,-27.910176468897848,10,"M$",0.4982888432580424,null,"Seg1","2022-10-01","2023-03-31",null,null,0.40225145134728019,0.41355821578305391,0,"True",0.75,0.75,"1","1",0,1,"MEADORS 36-1HX",7,"35-063-24620-0000","35063246200000","020345","269133","00007","23500112909",null,"A61BE2A680924536799100007"]
["WASHINGTON 2-19-18CH","A61BE2A680924536799500008","default","TxWells","All Cases","Proved","Producing","DUSTIN SOUTH","MISSISSIPPIAN","HUGHES","OK","CALYX ENERGY III LLC",8,"35063246520000",35.232259999999997,-96.076059999999998,0,"12330","N  9.0/E  12.0/SEC  19.0  SWSESWSE","0","0","Standard Case","Gas",0.2140623972354006,219.28146091239913,0,0,0.16054679792655044,164.46109568429929,0,"Mbbl","MMcf","bbl",67.165999999999997,4.6959999999999997,0,10.783338943719873,772.30681133964219,0,783.09015028336194,0.64218719170620187,246.69164352644898,0,247.33383071815513,178.28541067761807,86.187351129363449,511.80659252513664,0,55.560246162604528,0,50,50,50,0,165.72331159562071,159.11176957207937,10,"M$",3.4989733059548249,null,"Seg1","2022-10-01","2026-03-31",null,null,4.3144662319124167,5.5075723489239108,0.2491444216290212,"True",0.75,0.75,"1","1",0,1,"WASHINGTON 2-19-18CH",8,"35-063-24652-0000","35063246520000","014393","269133","00008","23500113057",null,"A61BE2A680924536799500008"]
["WASHINGTON 1-19-18WH","A61BE2A680924536799900009","default","TxWells","All Cases","Proved","Producing","DUSTIN SOUTH","WOODFORD","HUGHES","OK","CALYX ENERGY III LLC",9,"35063246530000",35.232259999999997,-96.075959999999995,0,"13100","N  9.0/E  12.0/SEC  19.0  SWSESWSE","12959","4469","Standard Case","Gas",5.3941725799799653E-2,123.7830090489431,0,0,4.045629434984975E-2,92.837256786707314,0,"Mbbl","MMcf","bbl",79.741,4.9720000000000004,0,3.2260304064733067,461.6173219274574,0,464.84335233393068,0.161825177399399,139.25588518006094,0,139.41771035746035,80.40527926078029,38.869798767967147,258.69278838620778,0,32.980635848092383,0,50,50,50,0,123.16992809963051,121.77160771392022,10,"M$",1.579739904175222,null,"Seg1","2022-10-01","2024-04-29",null,null,3.4633985619926095,3.8495781501409145,0.20260095824777541,"True",0.75,0.75,"1","1",0,1,"WASHINGTON 1-19-18WH",9,"35-063-24653-0000","35063246530000","014393","269133","00009","23500113079",null,"A61BE2A680924536799900009"]
["ADAMS 2-36-25CH","A61BE2A680924536800400010","default","TxWells","All Cases","Proved","Producing","CARSON","MISSISSIPPIAN","HUGHES","OK","CALYX ENERGY III LLC",10,"35063246930000",35.205440000000003,-96.104119999999995,0,"13435","N  9.0/E  11.0/SEC  36.0  SWNWSWSW","0","0","Standard Case","Gas",2.4622122884791067E-2,2189.030102018346,0,0,1.8466592163593299E-2,1641.7725765137595,0,"Mbbl","MMcf","bbl",82.031000000000006,4.7329999999999997,0,1.5148363668853551,7770.3581473604308,0,7771.8729837273177,7.3866368654373196E-2,2462.658864770639,0,2462.7327311392937,1053.3819244220711,509.22954070345122,4025.3441962648158,0,551.41438819545306,0,50,50,50,0,3145.1143992670486,1980.8683656162293,10,"M$",20.646132785763172,null,"Seg1","2022-10-01","2043-05-24",null,null,63.902287985340983,310.5294244434325,1.3689253935660501E-2,"True",0.75,0.75,"1","1",0,1,"ADAMS 2-36-25CH",10,"35-063-24693-0000","35063246930000","008500","269133","00010","23500113318",null,"A61BE2A680924536800400010"]
{"$rows_left_out":87}
{"sheet":"InvOneLiner","index":3,"n_rows":81,"n_cols":12,"rows_kept":81,"cut":false,"hidden":false,"merged":[]}
["PHDWinID","CaseName","GrossTan","GrossInTan","NetTan","NetInTan","RskInfGrossTan","RskInfGrossInTan","RskInfNetTan","RskInfNetInTan","RskNetTan","RskNetInTan"]
[50001,"Grand Total"]
[1,"CHITWOOD NORTHWEST UNIT"]
[2,"SANDRA FIU 03041H-9X"]
[3,"SANDRA 03043H-9X"]
[4,"SANDRA FIU 03042H-9X"]
[5,"THOMAS ESTATE"]
[6,"HARWELL 1-33"]
[7,"HOLINSWORTH 3H-9X"]
[8,"HOLINSWORTH 7H-9X"]
{"$rows_left_out":72}
{"sheet":"PriceQC","index":4,"n_rows":80,"n_cols":13,"rows_kept":80,"cut":false,"hidden":false,"merged":[]}
["CaseName","Field","AsofOilPrice","OilPriceUnits","AsofGasPrice","GasPriceUnits","OilDiffPercent","OilDiffValue","GasDiffPercent","GasDiffValue","GasPriceModel","OilPriceModel","BTU"]
["CHITWOOD NORTHWEST UNIT","CHITWOOD NORTHWEST",71.02,"$/bbl",6.2450000000000001,"$/Mcf",0,0,0,0,"NYMEX 12 09 2022[6.245]","NYMEX 12 09 2022[71.02]",0]
["SANDRA FIU 03041H-9X","GOLDEN TREND",71.02,"$/bbl",6.2450000000000001,"$/Mcf",0,0,0,0,"NYMEX 12 09 2022[6.245]","NYMEX 12 09 2022[71.02]",0]
["SANDRA 03043H-9X","GOLDEN TREND",71.02,"$/bbl",6.2450000000000001,"$/Mcf",0,0,0,0,"NYMEX 12 09 2022[6.245]","NYMEX 12 09 2022[71.02]",0]
["SANDRA FIU 03042H-9X","GOLDEN TREND",71.02,"$/bbl",6.2450000000000001,"$/Mcf",0,0,0,0,"NYMEX 12 09 2022[6.245]","NYMEX 12 09 2022[71.02]",0]
["THOMAS ESTATE","GOLDEN TREND",71.02,"$/bbl",6.2450000000000001,"$/Mcf",0,0,0,0,"NYMEX 12 09 2022[6.245]","NYMEX 12 09 2022[71.02]",0]
["HARWELL 1-33","GOLDEN TREND",71.02,"$/bbl",6.2450000000000001,"$/Mcf",0,0,0,0,"NYMEX 12 09 2022[6.245]","NYMEX 12 09 2022[71.02]",0]
["HOLINSWORTH 3H-9X","GOLDEN TREND",71.02,"$/bbl",8.1185000000000009,"$/Mcf",0,0,0,0,"NYMEX 12 09 2022[8.1185]","NYMEX 12 09 2022[71.02]",1300]
["HOLINSWORTH 7H-9X","GOLDEN TREND",71.02,"$/bbl",8.1185000000000009,"$/Mcf",0,0,0,0,"NYMEX 12 09 2022[8.1185]","NYMEX 12 09 2022[71.02]",1300]
["HOLINSWORTH 5H-9X","GOLDEN TREND",71.02,"$/bbl",8.1185000000000009,"$/Mcf",0,0,0,0,"NYMEX 12 09 2022[8.1185]","NYMEX 12 09 2022[71.02]",1300]
{"$rows_left_out":71}
{"sheet":"Projections","index":5,"n_rows":188,"n_cols":20,"rows_kept":188,"cut":false,"hidden":false,"merged":[]}
["UniqueId","Field","Case","Well","Reservoir","Product","Units","ProjType","Segment","StartDate","BegCum","Qi","NFactor","Decl","DeclMin","EndDate","Qf","Volume","EndCum","SolveFor"]
["A61BE2A680924536797500002","TIGER FLATS SOUTHEAST","KLIMEK 10-2H","10-2H","MISSISSIPPIAN","Gas","Mcf","Arps","1","8/1/2020 ",0,8193.5836947541484,1E-3,53.142770672797603,0,"5/31/2032 ",1.0417809036267127,126742.10721679303,0,"Vol;EDate"]
["A61BE2A680924536797800003","BEARDEN EAST","CHEATWOOD 15-1HX","15-1HX","MISSISSIPPIAN","Gas","Mcf","Arps","1","8/1/2019 ",0,16069.318627432991,1E-3,16.892285442504829,0,"7/31/2059 ",9.809594184608013,1037242.4489645625,0,"Vol;EDate"]
["A61BE2A680924536797800003","BEARDEN EAST","CHEATWOOD 15-1HX","15-1HX","MISSISSIPPIAN","Oil","bbl","Arps","1","11/1/2020 ",0,17.427957583264298,1E-3,80.046995775779109,0,"6/30/2022 ",1.1965958139971897,106.988715101869,0,"Vol;EDate"]
["A61BE2A680924536798100004","GREASY CREEK","FIELDS 19-1HX","19-1HX","MISSISSIPPIAN","Gas","Mcf","Arps","1","2/1/2021 ",0,17301.255838173107,1,29.244138622814862,0,"1/31/2061 ",1168.115552047339,1608442.1797876246,0,"Vol;EDate"]
["A61BE2A680924536798100004","GREASY CREEK","FIELDS 19-1HX","19-1HX","MISSISSIPPIAN","Oil","bbl","Arps","1","3/1/2021 ",0,2.634094946666707,1,10.04123994269176,0,"6/30/2036 ",1.0046914677242886,453.09737493816715,0,"Vol;EDate"]
["A61BE2A680924536798300005","GREASY CREEK","MEADORS 25-1H","25-1H","MISSISSIPPIAN","Gas","Mcf","Arps","1","2/1/2021 ",0,6721.1513271686126,1E-3,35.255101165858385,0,"3/31/2041 ",1.0496831745319564,182595.31157552518,0,"Vol;EDate"]
["A61BE2A680924536798300005","GREASY CREEK","MEADORS 25-1H","25-1H","MISSISSIPPIAN","Oil","bbl","Arps","1","2/1/2021 ",0,3.1069347662112259,1,10.04123994269176,0,"11/30/2040 ",1.0032046605572615,575.50517859094475,0,"Vol;EDate"]
["A61BE2A680924536798600006","GREASY CREEK","MEADORS 25-2H","25-2H","MISSISSIPPIAN","Gas","Mcf","Arps","1","7/1/2018 ",0,9149.2288355492783,1E-3,9.9475157104010883,0,"6/30/2058 ",138.42432691273402,1027664.4612810883,0,"Vol;EDate"]
["A61BE2A680924536798600006","GREASY CREEK","MEADORS 25-2H","25-2H","MISSISSIPPIAN","Oil","bbl","Arps","1","10/1/2020 ",0,5.8472822028004092,1E-3,15.018751777986717,0,"7/31/2031 ",1.0033605362444071,344.56012052025409,0,"Vol;EDate"]
{"$rows_left_out":178}